{"text_format":"1","workbook":"xlsx","n_sheets":9,"sheets":["Startpagina","Transport","Individuele dieren","Interval","rules","Dierenarts","rapport-tab","Prices","Lijsten"],"not_rendered":{"charts":0,"images":1,"macros":1,"external_links":0,"defined_names":13,"comments":0,"pivot_tables":0},"unopened":[],"bounds":{"document_bytes":16777216,"sheet_cells":100000,"rows_first":2000,"rows_last":500,"rows_between":2000,"halvings":0,"cell_chars":16384,"cell_head_chars":4096},"cells_cut":0,"cells_raw":0,"read":"whole","date_system":"1900"}

{"sheet":"Startpagina","index":0,"n_rows":29,"n_cols":10,"rows_kept":29,"cut":false,"hidden":false,"merged":[]}
[null,"versie 1.26","konijn toegevoegd",null,null,null,null,"laatste updates"]
[null,null,"intervaldieren aangepast",null,null,null,null,"exotische tekens weg  1.25"]
[null,null,"layout  rapport aangepast, nog niet merge transport en individ",null,null,null,null,"30 regels voor dierenartskosten 1.26"]
[null,null,"merge transport"]
[]
[null,"Facturatie dierenasielen","U kan per factuur slechts één dossier indienen met behulp van deze Excel bijlage."]
[]
[null,"Naam dierenasiel",null,{"$f":"IF(C8=\"\",\"verplicht veld\",\"\")","v":"verplicht veld"},null,{"$f":"IF(LEFT(HKNummer,4)=\"HK30\",0,1)","v":1}]
[null,"Erkenningsnummer (HK30999999)",null,{"$f":"IF(C9=\"\",\"verplicht veld\",\"\")","v":"verplicht veld"},{"$f":"IF(G9>0,\"verkeerd formaat\",\"\")","v":"verkeerd formaat"},{"$f":"IF(LEN(HKNummer)<>10,1,0)","v":1},{"$f":"F8+F9+J9","v":3},{"$f":"RIGHT(HKNummer,8)","v":""},{"$f":"H9+1","v":{"$error":"#VALUE!"}},{"$f":"IF(ISNUMBER(I9),0,1)","v":1}]
[null,"Ondernemingsnummer (0999999999)",null,{"$f":"IF(C10=\"\",\"verplicht veld\",\"\")","v":"verplicht veld"},{"$f":"IF(G10>0,\"verkeerd formaat\",\"\")","v":"verkeerd formaat"},{"$f":"IF(LEN(KBONummer)<>10,1,0)","v":1},{"$f":"F10+F11+J10","v":3},{"$f":"RIGHT(KBONummer,9)","v":""},{"$f":"H10+1","v":{"$error":"#VALUE!"}},{"$f":"IF(ISNUMBER(I10),0,1)","v":1}]
{"$rows_left_out":20}
{"sheet":"Transport","index":1,"n_rows":1026,"n_cols":8,"rows_kept":1026,"cut":false,"hidden":false,"merged":[]}
[null,"Datum IBN",{"$f":"Startpagina!C13","v":"00:00:00"},null,null,null,null,"TOTAAL"]
[null,"Transport",null,null,null,null,null,{"$f":"SUM(G:G)","v":0}]
[null,"Vervoermiddel","Datum rit","Aantal km (Heen en terug)","Forfait km HT","Km vergoeding boven forfait","Totaal","Commentaar"]
[null,null,{"$f":"IF(ISBLANK(B4),\"\",Startpagina!$C$13)","v":""},null,{"$f":"IF(B4<>\"\",VLOOKUP(B4,Lijsten!$A$3:$C$4,2,FALSE),\"\")","v":""},{"$f":"IF(B4<>\"\",VLOOKUP(B4,Lijsten!$A$3:$C$4,3,FALSE),\"\")","v":""},{"$f":"IF(D4<Afstanddrempel,E4,E4+(D4-Afstanddrempel)*F4)","v":""}]
[null,null,{"$f":"IF(ISBLANK(B5),\"\",Startpagina!$C$13)","v":""},null,{"$f":"IF(B5<>\"\",VLOOKUP(B5,Lijsten!$A$3:$C$4,2,FALSE),\"\")","v":""},{"$f":"IF(B5<>\"\",VLOOKUP(B5,Lijsten!$A$3:$C$4,3,FALSE),\"\")","v":""},{"$f":"IF(D5<Afstanddrempel,E5,E5+(D5-Afstanddrempel)*F5)","v":""}]
[null,null,{"$f":"IF(ISBLANK(B6),\"\",Startpagina!$C$13)","v":""},null,{"$f":"IF(B6<>\"\",VLOOKUP(B6,Lijsten!$A$3:$C$4,2,FALSE),\"\")","v":""},{"$f":"IF(B6<>\"\",VLOOKUP(B6,Lijsten!$A$3:$C$4,3,FALSE),\"\")","v":""},""]
[null,null,{"$f":"IF(ISBLANK(B7),\"\",Startpagina!$C$13)","v":""},null,{"$f":"IF(B7<>\"\",VLOOKUP(B7,Lijsten!$A$3:$C$4,2,FALSE),\"\")","v":""},{"$f":"IF(B7<>\"\",VLOOKUP(B7,Lijsten!$A$3:$C$4,3,FALSE),\"\")","v":""},""]
[null,null,{"$f":"IF(ISBLANK(B8),\"\",Startpagina!$C$13)","v":""},null,{"$f":"IF(B8<>\"\",VLOOKUP(B8,Lijsten!$A$3:$C$4,2,FALSE),\"\")","v":""},{"$f":"IF(B8<>\"\",VLOOKUP(B8,Lijsten!$A$3:$C$4,3,FALSE),\"\")","v":""},""]
[null,null,{"$f":"IF(ISBLANK(B9),\"\",Startpagina!$C$13)","v":""},null,{"$f":"IF(B9<>\"\",VLOOKUP(B9,Lijsten!$A$3:$C$4,2,FALSE),\"\")","v":""},{"$f":"IF(B9<>\"\",VLOOKUP(B9,Lijsten!$A$3:$C$4,3,FALSE),\"\")","v":""},""]
[null,null,{"$f":"IF(ISBLANK(B10),\"\",Startpagina!$C$13)","v":""},null,{"$f":"IF(B10<>\"\",VLOOKUP(B10,Lijsten!$A$3:$C$4,2,FALSE),\"\")","v":""},{"$f":"IF(B10<>\"\",VLOOKUP(B10,Lijsten!$A$3:$C$4,3,FALSE),\"\")","v":""},""]
{"$rows_left_out":1017}
{"sheet":"Individuele dieren","index":2,"n_rows":1634,"n_cols":9,"rows_kept":1634,"cut":false,"hidden":false,"merged":[]}
[null,"Datum IBN",{"$f":"Startpagina!C13","v":"00:00:00"},null,null,null,null,null,"TOTAAL"]
[null,"Individuele dieren",null,null,null,null,null,null,{"$f":"SUM(H:H)","v":0}]
[null,"Diersoort","Tarief per dier","Aantal","Datum in","Datum uit","Aantal dagen","Totaal","Commentaar"]
[null,null,{"$f":"IF(B4<>\"\",VLOOKUP(B4,Lijsten!$M$3:$N$13,2,FALSE),\"\")","v":""},null,{"$f":"IF(ISBLANK(B4),\"\",Startpagina!$C$13)","v":""},{"$f":"IF(ISBLANK(B4),\"\",Startpagina!$C$14)","v":""},{"$f":"IF(OR(E4=\"\",F4=\"\"),\"\",F4-E4+1)","v":""},{"$f":"IF(OR(F4=\"\",G4=\"\"),\"\",IF(C4=\"\",\"\",G4*D4*C4))","v":""}]
[null,null,{"$f":"IF(B5<>\"\",VLOOKUP(B5,Lijsten!$M$3:$N$13,2,FALSE),\"\")","v":""},null,{"$f":"IF(ISBLANK(B5),\"\",Startpagina!$C$13)","v":""},{"$f":"IF(ISBLANK(B5),\"\",Startpagina!$C$14)","v":""},{"$f":"IF(OR(E5=\"\",F5=\"\"),\"\",F5-E5+1)","v":""},{"$f":"IF(OR(F5=\"\",G5=\"\"),\"\",IF(C5=\"\",\"\",G5*D5*C5))","v":""}]
[null,null,{"$f":"IF(B6<>\"\",VLOOKUP(B6,Lijsten!$M$3:$N$13,2,FALSE),\"\")","v":""},null,{"$f":"IF(ISBLANK(B6),\"\",Startpagina!$C$13)","v":""},{"$f":"IF(ISBLANK(B6),\"\",Startpagina!$C$14)","v":""},"",""]
[null,null,{"$f":"IF(B7<>\"\",VLOOKUP(B7,Lijsten!$M$3:$N$13,2,FALSE),\"\")","v":""},null,{"$f":"IF(ISBLANK(B7),\"\",Startpagina!$C$13)","v":""},{"$f":"IF(ISBLANK(B7),\"\",Startpagina!$C$14)","v":""},"",""]
[null,null,{"$f":"IF(B8<>\"\",VLOOKUP(B8,Lijsten!$M$3:$N$13,2,FALSE),\"\")","v":""},null,{"$f":"IF(ISBLANK(B8),\"\",Startpagina!$C$13)","v":""},{"$f":"IF(ISBLANK(B8),\"\",Startpagina!$C$14)","v":""},"",""]
[null,null,{"$f":"IF(B9<>\"\",VLOOKUP(B9,Lijsten!$M$3:$N$13,2,FALSE),\"\")","v":""},null,{"$f":"IF(ISBLANK(B9),\"\",Startpagina!$C$13)","v":""},{"$f":"IF(ISBLANK(B9),\"\",Startpagina!$C$14)","v":""},"",""]
[null,null,{"$f":"IF(B10<>\"\",VLOOKUP(B10,Lijsten!$M$3:$N$13,2,FALSE),\"\")","v":""},null,{"$f":"IF(ISBLANK(B10),\"\",Startpagina!$C$13)","v":""},{"$f":"IF(ISBLANK(B10),\"\",Startpagina!$C$14)","v":""},"",""]
{"$rows_left_out":1625}
{"sheet":"Interval","index":3,"n_rows":1293,"n_cols":11,"rows_kept":1293,"cut":false,"hidden":false,"merged":[]}
[null,"Datum IBN",{"$f":"Startpagina!C13","v":"00:00:00"},null,null,null,null,null,null,null,"TOTAAL"]
[null,"Dieren per Interval",null,null,null,null,null,null,null,null,{"$f":"SUM(J:J)","v":0}]
[null,"In/Uitheems","Diersoort","Aantal",null,"Bedrag per interval","Datum in","Datum uit","Aantal dagen","Totaal","Commentaar"]
[null,null,null,null,{"$f":"IF(LEN(D4)=0,\"\",B4&C4&TEXT(D4,\"0000\"))","v":""},{"$f":"IF(ISNA(VLOOKUP(B4&C4,Prices!$I$2:$I$546,8,FALSE)),\"\",VLOOKUP(E4,Prices!$B$2:$C$546,2,TRUE))","v":""},{"$f":"IF(ISBLANK(B4),\"\",Startpagina!$C$13)","v":""},{"$f":"IF(ISBLANK(B4),\"\",Startpagina!$C$14)","v":""},{"$f":"IF(OR(G4=\"\",H4=\"\"),\"\",H4-G4+1)","v":""},{"$f":"IF(ISNUMBER(F4*I4),F4*I4,\"\")","v":""}]
[null,null,null,null,{"$f":"IF(LEN(D5)=0,\"\",B5&C5&TEXT(D5,\"0000\"))","v":""},{"$f":"IF(ISNA(VLOOKUP(B5&C5,Prices!$I$2:$I$546,8,FALSE)),\"\",VLOOKUP(E5,Prices!$B$2:$C$546,2,TRUE))","v":""},{"$f":"IF(ISBLANK(B5),\"\",Startpagina!$C$13)","v":""},{"$f":"IF(ISBLANK(B5),\"\",Startpagina!$C$14)","v":""},{"$f":"IF(OR(G5=\"\",H5=\"\"),\"\",H5-G5+1)","v":""},{"$f":"IF(ISNUMBER(F5*I5),F5*I5,\"\")","v":""}]
[null,null,null,null,"",{"$f":"IF(ISNA(VLOOKUP(B6&C6,Prices!$I$2:$I$546,8,FALSE)),\"\",VLOOKUP(E6,Prices!$B$2:$C$546,2,TRUE))","v":""},{"$f":"IF(ISBLANK(B6),\"\",Startpagina!$C$13)","v":""},{"$f":"IF(ISBLANK(B6),\"\",Startpagina!$C$14)","v":""},"",""]
[null,null,null,null,"",{"$f":"IF(ISNA(VLOOKUP(B7&C7,Prices!$I$2:$I$546,8,FALSE)),\"\",VLOOKUP(E7,Prices!$B$2:$C$546,2,TRUE))","v":""},{"$f":"IF(ISBLANK(B7),\"\",Startpagina!$C$13)","v":""},{"$f":"IF(ISBLANK(B7),\"\",Startpagina!$C$14)","v":""},"",""]
[null,null,null,null,"",{"$f":"IF(ISNA(VLOOKUP(B8&C8,Prices!$I$2:$I$546,8,FALSE)),\"\",VLOOKUP(E8,Prices!$B$2:$C$546,2,TRUE))","v":""},{"$f":"IF(ISBLANK(B8),\"\",Startpagina!$C$13)","v":""},{"$f":"IF(ISBLANK(B8),\"\",Startpagina!$C$14)","v":""},"",""]
[null,null,null,null,"",{"$f":"IF(ISNA(VLOOKUP(B9&C9,Prices!$I$2:$I$546,8,FALSE)),\"\",VLOOKUP(E9,Prices!$B$2:$C$546,2,TRUE))","v":""},{"$f":"IF(ISBLANK(B9),\"\",Startpagina!$C$13)","v":""},{"$f":"IF(ISBLANK(B9),\"\",Startpagina!$C$14)","v":""},"",""]
[null,null,null,null,"",{"$f":"IF(ISNA(VLOOKUP(B10&C10,Prices!$I$2:$I$546,8,FALSE)),\"\",VLOOKUP(E10,Prices!$B$2:$C$546,2,TRUE))","v":""},{"$f":"IF(ISBLANK(B10),\"\",Startpagina!$C$13)","v":""},{"$f":"IF(ISBLANK(B10),\"\",Startpagina!$C$14)","v":""},"",""]
{"$rows_left_out":1284}
{"sheet":"rules","index":4,"n_rows":14,"n_cols":1,"rows_kept":14,"cut":false,"hidden":true,"merged":[]}
["Ik weet dat Bente eerder iets anders doorgaf, maar mijn twee collega’s gaven onderstaande feedback (geldt enkel voor hond & paard/pony/ezel):"]
[]
["Identificeren > automatisch ook registreren en paspoort, kan niet alleen"]
[]
["Registreren > kan ook alleen"]
["Een hond kan gechipt zijn en een paspoort hebben maar nog niet geregistreerd zijn."]
[]
["Paspoort > kan ook alleen"]
["Een hond kan gechipt en geregistreerd zijn. Het paspoort is niet meegekomen."]
[]
{"$rows_left_out":5}
{"sheet":"Dierenarts","index":5,"n_rows":1048,"n_cols":32,"rows_kept":1048,"cut":false,"hidden":false,"merged":[]}
[null,"Datum IBN",{"$f":"Startpagina!C13","v":"00:00:00"},null,null,null,null,null,null,null,null,null,null,null,{"$f":"Startpagina!H13","v":1},"TOTAAL"]
[null,"Diergeneeskundig verslag",null,null,null,null,null,null,null,null,null,null,null,null,null,{"$f":"IF(O1=1,0,SUM(E4:E7))","v":0}]
[null,"Dierenarts","Datum","Aantal dieren","EUR",null,null,null,{"$f":"IF(O1=1,Startpagina!F13,\"\")","v":"Tab Dierenarts pas invullen vanaf datum IBN 01/06/2023"}]
[null,null,null,null,{"$f":"IF(D4>0,30+ROUNDUP(D4/10,0)*5,0)","v":0}]
[null,null,null,null,0]
[null,null,null,null,0]
[null,null,null,null,{"$f":"IF(D7>0,30+ROUNDUP(D7/10,0)*5,0)","v":0}]
[null,null,null,null,null,null,null,null,null,null,null,null,null,null,null,"TOTAAL"]
[null,"Dierenartskosten",null,{"$f":"IF(S42>0,\"Gelieve de fouten te verbeteren.  Zie rode vakjes\",\"\")","v":""},null,null,null,null,null,null,null,null,null,null,null,{"$f":"IF(O1=1,0,SUM(P11:P40))","v":0},null,null,null,null,null,null,"paspoort niet meer te valideren"]
[null,"Naam/\nomschrijving","Diersoort","Identificatie-nummer","Geslacht (enkel bij Kat)","Identificeren","EUR","Registreren","EUR","Paspoort","EUR","Vaccinatie","EUR","Sterilisatie/\ncastratie","EUR","Totaal",null,null,null,"Idnr",null,null,"paspoort",null,"staat nu op 0","factor paspoort",null,"identificeren hond 1","paard 4","kat 2","totaal","factor"]
{"$rows_left_out":1039}
{"sheet":"rapport-tab","index":6,"n_rows":138,"n_cols":11,"rows_kept":138,"cut":false,"hidden":true,"merged":[[7,0,7,3],[43,6,43,10],[55,7,55,10],[56,7,56,10],[57,7,57,10],[44,6,44,10],[45,6,45,10],[46,6,46,10],[49,7,49,10],[50,7,50,10],[51,7,51,10],[52,7,52,10],[53,7,53,10],[54,7,54,10],[47,6,47,10],[73,8,73,10],[74,8,74,10],[75,8,75,10],[76,8,76,10],[58,7,58,10],[60,7,60,10],[59,7,59,10],[68,8,68,10],[69,8,69,10],[70,8,70,10],[71,8,71,10],[72,8,72,10],[63,8,63,10],[64,8,64,10],[65,8,65,10],[66,8,66,10],[67,8,67,10],[78,8,78,10],[79,8,79,10],[80,8,80,10],[33,6,33,10],[34,6,34,10],[48,7,48,10],[35,6,35,10],[36,6,36,10],[37,6,37,10],[38,6,38,10],[39,6,39,10],[40,6,40,10],[41,6,41,10],[42,6,42,10],[77,8,77,10]]}
[null,null,null,null,null,null,null,null,null,null,{"$f":"Startpagina!B1","v":"versie 1.26"}]
[]
[]
[]
[]
["Facturatie dierenasielen"]
[]
[{"$f":"Startpagina!B8","v":"Naam dierenasiel"},null,null,null,{"$f":"Naam","v":0},{"$f":"Startpagina!D8","v":"verplicht veld"}]
[{"$f":"Startpagina!B9","v":"Erkenningsnummer (HK30999999)"},null,"",null,{"$f":"HKNummer","v":0},{"$f":"Startpagina!D9","v":"verplicht veld"}]
[{"$f":"Startpagina!B10","v":"Ondernemingsnummer (0999999999)"},null,null,null,{"$f":"KBONummer","v":0},{"$f":"Startpagina!D10","v":"verplicht veld"}]
{"$rows_left_out":129}
{"sheet":"Prices","index":7,"n_rows":553,"n_cols":14,"rows_kept":553,"cut":false,"hidden":true,"merged":[]}
["nr","combo hierop sorteren",null,"Category","Name","van","tot","prijs",null,null,null,null,null,"Uitheems"]
[510,{"$f":"D2&E2&TEXT(F2,\"0000\")","v":"InheemsAmfibieën0001"},{"$f":"H2","v":3.15},"Inheems","Amfibieën",1,5,3.15,{"$f":"D2&E2","v":"InheemsAmfibieën"}]
[511,"InheemsAmfibieën0006",9.4499999999999993,"Inheems","Amfibieën",6,15,9.4499999999999993,"InheemsAmfibieën"]
[512,"InheemsAmfibieën0016",22.05,"Inheems","Amfibieën",16,35,22.05,"InheemsAmfibieën"]
[513,"InheemsAmfibieën0036",34.65,"Inheems","Amfibieën",36,55,34.65,"InheemsAmfibieën"]
[514,"InheemsAmfibieën0051",47.25,"Inheems","Amfibieën",51,75,47.25,"InheemsAmfibieën"]
[515,"InheemsAmfibieën0076",63,"Inheems","Amfibieën",76,100,63,"InheemsAmfibieën"]
[402,"InheemsDuiven0001",1.02,"Inheems","Duiven",1,3,1.02,"InheemsDuiven"]
[403,"InheemsDuiven0004",3.4000000000000004,"Inheems","Duiven",4,10,3.4000000000000004,"InheemsDuiven"]
[404,"InheemsDuiven0011",8.5,"Inheems","Duiven",11,25,8.5,"InheemsDuiven"]
{"$rows_left_out":544}
{"sheet":"Lijsten","index":8,"n_rows":41,"n_cols":19,"rows_kept":41,"cut":false,"hidden":true,"merged":[]}
["keuze","tarief","tarief",null,null,null,"keuze","keuze","keuze",null,"keuze",null,"tarief",null,null,"Keuze",null,null,"Keuze"]
["Vervoermiddel","Forfait heen/terug","Bijkomende vergoeding/km",null,"Periode:",null,"Individuele dieren","Inheems/Uitheems","Uitheems diersoorten",null,"Inheemse diersoorten",null,"Individuele dieren","Tarief per individueel dier",null,"Diersoort","Identificeren",null,"Geslacht Kat"]
["Auto/bestelwagen",40,0.8,null,"Januari - Maart",null,"Hond","Inheems","Eenden en hoenderen",null,"Eenden en hoenderen",null,"(Hangbuik)varken",10,null,"Hond",6,1,"Kater"]
["Vrachtwagen/trailer",80,1.2,null,"April - Juni",null,"Kat","Uitheems","Zoogdieren - klein",null,"Zoogdieren - klein",null,"Ezel",10,null,"Kat",6,2,"Kattin"]
[null,null,null,null,"Juli - September",null,"Paard",null,"Uitheemse vogels - klein",null,"Amfibieën",null,"Fret",5,null,"Kleine Herkauwer",2.5,3]
[null,null,null,null,"Oktober - December",null,"Ezel",null,"Ganzen en zwanen",null,"Duiven",null,"Geit",8,null,"Paard/Pony/Ezel",6,4]
["Afstanddrempel",50,null,null,null,null,"Fret",null,"Geleedpotigen",null,"Fazant & Wilde Eend",null,"Hond",10]
[null,null,null,null,null,null,"Geit",null,"Grote herbivoren",null,"Ganzen en zwanen",null,"Kat",10,null,null,"Registreren",null,"Keuze"]
["tab dierenarts vanaf","2023-06-01","Tab Dierenarts pas invullen vanaf datum IBN ",{"$f":"C9&TEXT(B9,\"dd/mm/jjjj\")","v":"Tab Dierenarts pas invullen vanaf datum IBN 01/06/2023"},null,null,"(Hangbuik)varken",null,"Grote katachtigen",null,"Insectenetende wildzang",null,"Konijn",3,null,"Hond",10.46,null,"janee"]
["factuurdatum vanaf","2022-01-01","Factuurdatum vanaf ",{"$f":"C10&TEXT(B10,\"dd/mm/jjjj\")","v":"Factuurdatum vanaf 01/01/2022"},null,null,"Konijn",null,"Hagedissen",null,"Kraaiachtigen",null,"Paard",10,null,"Kat",2.9,null,"ja"]
{"$rows_left_out":31}