{"text_format":"1","workbook":"xlsx","n_sheets":9,"sheets":["Startpagina","Transport","Individuele dieren","Interval","rules","Dierenarts","rapport-tab","Prices","Lijsten"],"not_rendered":{"charts":0,"images":1,"macros":1,"external_links":0,"defined_names":13,"comments":0,"pivot_tables":0},"unopened":[],"bounds":{"document_bytes":16777216,"sheet_cells":100000,"rows_first":2000,"rows_last":500,"rows_between":2000,"halvings":0,"cell_chars":16384,"cell_head_chars":4096},"cells_cut":0,"cells_raw":0,"read":"whole","date_system":"1900"}

{"sheet":"Startpagina","index":0,"n_rows":29,"n_cols":10,"rows_kept":29,"cut":false,"hidden":false,"merged":[]}
[null,"versie 1.26","konijn toegevoegd",null,null,null,null,"laatste updates"]
[null,null,"intervaldieren aangepast",null,null,null,null,"exotische tekens weg  1.25"]
[null,null,"layout  rapport aangepast, nog niet merge transport en individ",null,null,null,null,"30 regels voor dierenartskosten 1.26"]
[null,null,"merge transport"]
[]
[null,"Facturatie dierenasielen","U kan per factuur slechts één dossier indienen met behulp van deze Excel bijlage."]
[]
[null,"Naam dierenasiel",null,{"$f":"IF(C8=\"\",\"verplicht veld\",\"\")","v":"verplicht veld"},null,{"$f":"IF(LEFT(HKNummer,4)=\"HK30\",0,1)","v":1}]
[null,"Erkenningsnummer (HK30999999)",null,{"$f":"IF(C9=\"\",\"verplicht veld\",\"\")","v":"verplicht veld"},{"$f":"IF(G9>0,\"verkeerd formaat\",\"\")","v":"verkeerd formaat"},{"$f":"IF(LEN(HKNummer)<>10,1,0)","v":1},{"$f":"F8+F9+J9","v":3},{"$f":"RIGHT(HKNummer,8)","v":""},{"$f":"H9+1","v":{"$error":"#VALUE!"}},{"$f":"IF(ISNUMBER(I9),0,1)","v":1}]
[null,"Ondernemingsnummer (0999999999)",null,{"$f":"IF(C10=\"\",\"verplicht veld\",\"\")","v":"verplicht veld"},{"$f":"IF(G10>0,\"verkeerd formaat\",\"\")","v":"verkeerd formaat"},{"$f":"IF(LEN(KBONummer)<>10,1,0)","v":1},{"$f":"F10+F11+J10","v":3},{"$f":"RIGHT(KBONummer,9)","v":""},{"$f":"H10+1","v":{"$error":"#VALUE!"}},{"$f":"IF(ISNUMBER(I10),0,1)","v":1}]
[null,null,null,null,null,{"$f":"IF(LEFT(KBONummer,1)=\"0\",0,1)","v":1}]
[null,"Dossiernummer",null,{"$f":"IF(C12=\"\",\"verplicht veld\",IF(J13,\"Formaat moet zijn: G-XX-XXXX\",\"\"))","v":"verplicht veld"}]
[null,"Datum IBN  (dd/mm/jjjj) ",null,{"$f":"IF(C13=\"\",\"verplicht veld\",\"\")","v":"verplicht veld"},{"$f":"IF(NOW()-C13>731,\"maximaal 2 jaar terug in de tijd\",\"\")","v":"maximaal 2 jaar terug in de tijd"},{"$f":"IF(C13<Lijsten!B9,Lijsten!D9,\"\")","v":"Tab Dierenarts pas invullen vanaf datum IBN 01/06/2023"},null,{"$f":"IF(C13<Lijsten!B9,1)","v":1},null,{"$f":"OR(LEFT(C12,1) <> \"G\",LEN(C12) <> 9,MID(C12,2,1) <> \"-\",MID(C12,5,1) <> \"-\" )","v":true}]
[null,"Datum bestemmingsbeslissing  (dd/mm/jjjj)   (*)",null,{"$f":"IF(C14<C13,\"datum bestemmingsbeslissing kan niet vroeger zijn dan datum IBN\",\"\")","v":""}]
[null,"Factuurdatum  (dd/mm/jjjj)",null,{"$f":"IF(C15=\"\",\"verplicht veld\",\"\")","v":"verplicht veld"},null,{"$f":"IF(C15<Lijsten!B10,Lijsten!D10,\"\")","v":"Factuurdatum vanaf 01/01/2022"},null,1]
[null,"Dit bestand is de bijlage bij factuur met nummer"]
[null,"Bedrag op te nemen op de factuur",{"$f":"SUM(C20:C24)","v":0}]
[]
[null,"Uitsplitsing"]
[null,{"$f":"Transport!B2","v":"Transport"},{"$f":"Transport!H2","v":0}]
[null,{"$f":"'Individuele dieren'!B2","v":"Individuele dieren"},{"$f":"'Individuele dieren'!I2","v":0}]
[null,{"$f":"Interval!B2","v":"Dieren per Interval"},{"$f":"Interval!K2","v":0}]
[null,{"$f":"Dierenarts!B2","v":"Diergeneeskundig verslag"},{"$f":"Dierenarts!P2","v":0},{"$f":"IF(H13=1,\"Niet van toepassing\",\"\")","v":"Niet van toepassing"}]
[null,{"$f":"Dierenarts!B9","v":"Dierenartskosten"},{"$f":"Dierenarts!P9","v":0},{"$f":"IF(H13=1,\"Niet van toepassing\",\"\")","v":"Niet van toepassing"}]
[]
[]
[null," *  of datum ophaling door de eigenaar of, bij niet-ophaling, de uiterste datum voor ophaling zoals in de bestemmingsbeslissing vastgelegd"]
[]
[null,"Het dierenasiel is verantwoordelijk voor de juistheid van alle aan de afdeling overgemaakte gegevens."]

{"sheet":"Transport","index":1,"n_rows":1026,"n_cols":8,"rows_kept":1026,"cut":false,"hidden":false,"merged":[]}
[null,"Datum IBN",{"$f":"Startpagina!C13","v":"00:00:00"},null,null,null,null,"TOTAAL"]
[null,"Transport",null,null,null,null,null,{"$f":"SUM(G:G)","v":0}]
[null,"Vervoermiddel","Datum rit","Aantal km (Heen en terug)","Forfait km HT","Km vergoeding boven forfait","Totaal","Commentaar"]
[null,null,{"$f":"IF(ISBLANK(B4),\"\",Startpagina!$C$13)","v":""},null,{"$f":"IF(B4<>\"\",VLOOKUP(B4,Lijsten!$A$3:$C$4,2,FALSE),\"\")","v":""},{"$f":"IF(B4<>\"\",VLOOKUP(B4,Lijsten!$A$3:$C$4,3,FALSE),\"\")","v":""},{"$f":"IF(D4<Afstanddrempel,E4,E4+(D4-Afstanddrempel)*F4)","v":""}]
[null,null,{"$f":"IF(ISBLANK(B5),\"\",Startpagina!$C$13)","v":""},null,{"$f":"IF(B5<>\"\",VLOOKUP(B5,Lijsten!$A$3:$C$4,2,FALSE),\"\")","v":""},{"$f":"IF(B5<>\"\",VLOOKUP(B5,Lijsten!$A$3:$C$4,3,FALSE),\"\")","v":""},{"$f":"IF(D5<Afstanddrempel,E5,E5+(D5-Afstanddrempel)*F5)","v":""}]
[null,null,{"$f":"IF(ISBLANK(B6),\"\",Startpagina!$C$13)","v":""},null,{"$f":"IF(B6<>\"\",VLOOKUP(B6,Lijsten!$A$3:$C$4,2,FALSE),\"\")","v":""},{"$f":"IF(B6<>\"\",VLOOKUP(B6,Lijsten!$A$3:$C$4,3,FALSE),\"\")","v":""},""]
[null,null,{"$f":"IF(ISBLANK(B7),\"\",Startpagina!$C$13)","v":""},null,{"$f":"IF(B7<>\"\",VLOOKUP(B7,Lijsten!$A$3:$C$4,2,FALSE),\"\")","v":""},{"$f":"IF(B7<>\"\",VLOOKUP(B7,Lijsten!$A$3:$C$4,3,FALSE),\"\")","v":""},""]
[null,null,{"$f":"IF(ISBLANK(B8),\"\",Startpagina!$C$13)","v":""},null,{"$f":"IF(B8<>\"\",VLOOKUP(B8,Lijsten!$A$3:$C$4,2,FALSE),\"\")","v":""},{"$f":"IF(B8<>\"\",VLOOKUP(B8,Lijsten!$A$3:$C$4,3,FALSE),\"\")","v":""},""]
[null,null,{"$f":"IF(ISBLANK(B9),\"\",Startpagina!$C$13)","v":""},null,{"$f":"IF(B9<>\"\",VLOOKUP(B9,Lijsten!$A$3:$C$4,2,FALSE),\"\")","v":""},{"$f":"IF(B9<>\"\",VLOOKUP(B9,Lijsten!$A$3:$C$4,3,FALSE),\"\")","v":""},""]
[null,null,{"$f":"IF(ISBLANK(B10),\"\",Startpagina!$C$13)","v":""},null,{"$f":"IF(B10<>\"\",VLOOKUP(B10,Lijsten!$A$3:$C$4,2,FALSE),\"\")","v":""},{"$f":"IF(B10<>\"\",VLOOKUP(B10,Lijsten!$A$3:$C$4,3,FALSE),\"\")","v":""},""]
[null,null,{"$f":"IF(ISBLANK(B11),\"\",Startpagina!$C$13)","v":""},null,{"$f":"IF(B11<>\"\",VLOOKUP(B11,Lijsten!$A$3:$C$4,2,FALSE),\"\")","v":""},{"$f":"IF(B11<>\"\",VLOOKUP(B11,Lijsten!$A$3:$C$4,3,FALSE),\"\")","v":""},""]
[null,null,{"$f":"IF(ISBLANK(B12),\"\",Startpagina!$C$13)","v":""},null,{"$f":"IF(B12<>\"\",VLOOKUP(B12,Lijsten!$A$3:$C$4,2,FALSE),\"\")","v":""},{"$f":"IF(B12<>\"\",VLOOKUP(B12,Lijsten!$A$3:$C$4,3,FALSE),\"\")","v":""},""]
[null,null,{"$f":"IF(ISBLANK(B13),\"\",Startpagina!$C$13)","v":""},null,{"$f":"IF(B13<>\"\",VLOOKUP(B13,Lijsten!$A$3:$C$4,2,FALSE),\"\")","v":""},{"$f":"IF(B13<>\"\",VLOOKUP(B13,Lijsten!$A$3:$C$4,3,FALSE),\"\")","v":""},""]
[null,null,{"$f":"IF(ISBLANK(B14),\"\",Startpagina!$C$13)","v":""},null,{"$f":"IF(B14<>\"\",VLOOKUP(B14,Lijsten!$A$3:$C$4,2,FALSE),\"\")","v":""},{"$f":"IF(B14<>\"\",VLOOKUP(B14,Lijsten!$A$3:$C$4,3,FALSE),\"\")","v":""},""]
[null,null,{"$f":"IF(ISBLANK(B15),\"\",Startpagina!$C$13)","v":""},null,{"$f":"IF(B15<>\"\",VLOOKUP(B15,Lijsten!$A$3:$C$4,2,FALSE),\"\")","v":""},{"$f":"IF(B15<>\"\",VLOOKUP(B15,Lijsten!$A$3:$C$4,3,FALSE),\"\")","v":""},""]
[null,null,{"$f":"IF(ISBLANK(B16),\"\",Startpagina!$C$13)","v":""},null,{"$f":"IF(B16<>\"\",VLOOKUP(B16,Lijsten!$A$3:$C$4,2,FALSE),\"\")","v":""},{"$f":"IF(B16<>\"\",VLOOKUP(B16,Lijsten!$A$3:$C$4,3,FALSE),\"\")","v":""},""]
[null,null,{"$f":"IF(ISBLANK(B17),\"\",Startpagina!$C$13)","v":""},null,{"$f":"IF(B17<>\"\",VLOOKUP(B17,Lijsten!$A$3:$C$4,2,FALSE),\"\")","v":""},{"$f":"IF(B17<>\"\",VLOOKUP(B17,Lijsten!$A$3:$C$4,3,FALSE),\"\")","v":""},""]
[null,null,{"$f":"IF(ISBLANK(B18),\"\",Startpagina!$C$13)","v":""},null,{"$f":"IF(B18<>\"\",VLOOKUP(B18,Lijsten!$A$3:$C$4,2,FALSE),\"\")","v":""},{"$f":"IF(B18<>\"\",VLOOKUP(B18,Lijsten!$A$3:$C$4,3,FALSE),\"\")","v":""},{"$f":"IF(D18<Afstanddrempel,E18,E18+(D18-Afstanddrempel)*F18)","v":""}]
[]
[]
[]
[]
[]
[]
[]
[]
[]
[]
[]
[]
[]
[]
[]
[]
[]
[]
[]
[]
[]
[]
[]
[]
[]
[]
[]
[]
[]
[]
[]
[]
[]
[]
[]
[]
[]
[]
[]
[]
[]
[]
[]
[]
[]
[]
[]
[]
[]
[]
[]
[]
[]
[]
[]
[]
[]
[]
[]
[]
[]
[]
[]
[]
[]
[]
[]
[]
[]
[]
[]
[]
[]
[]
[]
[]
[]
[]
[]
[]
[]
[]
[]
[]
[]
[]
[]
[]
[]
[]
[]
[]
[]
[]
[]
[]
[]
[]
[]
[]
[]
[]
[]
[]
[]
[]
[]
[]
[]
[]
[]
[]
[]
[]
[]
[]
[]
[]
[]
[]
[]
[]
[]
[]
[]
[]
[]
[]
[]
[]
[]
[]
[]
[]
[]
[]
[]
[]
[]
[]
[]
[]
[]
[]
[]
[]
[]
[]
[]
[]
[]
[]
[]
[]
[]
[]
[]
[]
[]
[]
[]
[]
[]
[]
[]
[]
[]
[]
[]
[]
[]
[]
[]
[]
[]
[]
[]
[]
[]
[]
[]
[]
[]
[]
[]
[]
[]
[]
[]
[]
[]
[]
[]
[]
[]
[]
[]
[]
[]
[]
[]
[]
[]
[]
[]
[]
[]
[]
[]
[]
[]
[]
[]
[]
[]
[]
[]
[]
[]
[]
[]
[]
[]
[]
[]
[]
[]
[]
[]
[]
[]
[]
[]
[]
[]
[]
[]
[]
[]
[]
[]
[]
[]
[]
[]
[]
[]
[]
[]
[]
[]
[]
[]
[]
[]
[]
[]
[]
[]
[]
[]
[]
[]
[]
[]
[]
[]
[]
[]
[]
[]
[]
[]
[]
[]
[]
[]
[]
[]
[]
[]
[]
[]
[]
[]
[]
[]
[]
[]
[]
[]
[]
[]
[]
[]
[]
[]
[]
[]
[]
[]
[]
[]
[]
[]
[]
[]
[]
[]
[]
[]
[]
[]
[]
[]
[]
[]
[]
[]
[]
[]
[]
[]
[]
[]
[]
[]
[]
[]
[]
[]
[]
[]
[]
[]
[]
[]
[]
[]
[]
[]
[]
[]
[]
[]
[]
[]
[]
[]
[]
[]
[]
[]
[]
[]
[]
[]
[]
[]
[]
[]
[]
[]
[]
[]
[]
[]
[]
[]
[]
[]
[]
[]
[]
[]
[]
[]
[]
[]
[]
[]
[]
[]
[]
[]
[]
[]
[]
[]
[]
[]
[]
[]
[]
[]
[]
[]
[]
[]
[]
[]
[]
[]
[]
[]
[]
[]
[]
[]
[]
[]
[]
[]
[]
[]
[]
[]
[]
[]
[]
[]
[]
[]
[]
[]
[]
[]
[]
[]
[]
[]
[]
[]
[]
[]
[]
[]
[]
[]
[]
[]
[]
[]
[]
[]
[]
[]
[]
[]
[]
[]
[]
[]
[]
[]
[]
[]
[]
[]
[]
[]
[]
[]
[]
[]
[]
[]
[]
[]
[]
[]
[]
[]
[]
[]
[]
[]
[]
[]
[]
[]
[]
[]
[]
[]
[]
[]
[]
[]
[]
[]
[]
[]
[]
[]
[]
[]
[]
[]
[]
[]
[]
[]
[]
[]
[]
[]
[]
[]
[]
[]
[]
[]
[]
[]
[]
[]
[]
[]
[]
[]
[]
[]
[]
[]
[]
[]
[]
[]
[]
[]
[]
[]
[]
[]
[]
[]
[]
[]
[]
[]
[]
[]
[]
[]
[]
[]
[]
[]
[]
[]
[]
[]
[]
[]
[]
[]
[]
[]
[]
[]
[]
[]
[]
[]
[]
[]
[]
[]
[]
[]
[]
[]
[]
[]
[]
[]
[]
[]
[]
[]
[]
[]
[]
[]
[]
[]
[]
[]
[]
[]
[]
[]
[]
[]
[]
[]
[]
[]
[]
[]
[]
[]
[]
[]
[]
[]
[]
[]
[]
[]
[]
[]
[]
[]
[]
[]
[]
[]
[]
[]
[]
[]
[]
[]
[]
[]
[]
[]
[]
[]
[]
[]
[]
[]
[]
[]
[]
[]
[]
[]
[]
[]
[]
[]
[]
[]
[]
[]
[]
[]
[]
[]
[]
[]
[]
[]
[]
[]
[]
[]
[]
[]
[]
[]
[]
[]
[]
[]
[]
[]
[]
[]
[]
[]
[]
[]
[]
[]
[]
[]
[]
[]
[]
[]
[]
[]
[]
[]
[]
[]
[]
[]
[]
[]
[]
[]
[]
[]
[]
[]
[]
[]
[]
[]
[]
[]
[]
[]
[]
[]
[]
[]
[]
[]
[]
[]
[]
[]
[]
[]
[]
[]
[]
[]
[]
[]
[]
[]
[]
[]
[]
[]
[]
[]
[]
[]
[]
[]
[]
[]
[]
[]
[]
[]
[]
[]
[]
[]
[]
[]
[]
[]
[]
[]
[]
[]
[]
[]
[]
[]
[]
[]
[]
[]
[]
[]
[]
[]
[]
[]
[]
[]
[]
[]
[]
[]
[]
[]
[]
[]
[]
[]
[]
[]
[]
[]
[]
[]
[]
[]
[]
[]
[]
[]
[]
[]
[]
[]
[]
[]
[]
[]
[]
[]
[]
[]
[]
[]
[]
[]
[]
[]
[]
[]
[]
[]
[]
[]
[]
[]
[]
[]
[]
[]
[]
[]
[]
[]
[]
[]
[]
[]
[]
[]
[]
[]
[]
[]
[]
[]
[]
[]
[]
[]
[]
[]
[]
[]
[]
[]
[]
[]
[]
[]
[]
[]
[]
[]
[]
[]
[]
[]
[]
[]
[]
[]
[]
[]
[]
[]
[]
[]
[]
[]
[]
[]
[]
[]
[]
[]
[]
[]
[]
[]
[]
[]
[]
[]
[]
[]
[]
[]
[]
[]
[]
[]
[]
[]
[]
[]
[]
[]
[]
[]
[]
[]
[]
[]
[]
[]
[]
[]
[]
[]
[]
[]
[]
[]
[]
[]
[]
[]
[]
[]
[]
[]
[]
[]
[]
[]
[]
[]
[]
[]
[]
[]
[]
[]
[]
[]
[]
[]
[]
[]
[]
[]
[]
[]
[]
[]
[]
[]
[]
[]
[]
[]
[]
[]
[]
[]
[]
[]
[]
[]
[]
[]
[]
[]
[]
[]
[]
[]
[]
[]
[]
[]
[]
[]
[]
[]
[]
[]
[]
[]
[]
[]
[]
[]
[]
[]
[]
[]
[]
[]
[]
[]
[]
[]
[]
[]
[]
[]
[]
[]
[]
[]
[null,null,null,null,{"$f":"IF(C1026<>\"\",VLOOKUP(C1026,Lijsten!$A$3:$C$4,2,FALSE),\"\")","v":""},{"$f":"IF(C1026<>\"\",VLOOKUP(C1026,Lijsten!$A$3:$C$4,3,FALSE),\"\")","v":""},{"$f":"IF(D1026<Afstanddrempel,E1026,E1026+(D1026-Afstanddrempel)*F1026)","v":""}]

{"sheet":"Individuele dieren","index":2,"n_rows":1634,"n_cols":9,"rows_kept":1634,"cut":false,"hidden":false,"merged":[]}
[null,"Datum IBN",{"$f":"Startpagina!C13","v":"00:00:00"},null,null,null,null,null,"TOTAAL"]
[null,"Individuele dieren",null,null,null,null,null,null,{"$f":"SUM(H:H)","v":0}]
[null,"Diersoort","Tarief per dier","Aantal","Datum in","Datum uit","Aantal dagen","Totaal","Commentaar"]
[null,null,{"$f":"IF(B4<>\"\",VLOOKUP(B4,Lijsten!$M$3:$N$13,2,FALSE),\"\")","v":""},null,{"$f":"IF(ISBLANK(B4),\"\",Startpagina!$C$13)","v":""},{"$f":"IF(ISBLANK(B4),\"\",Startpagina!$C$14)","v":""},{"$f":"IF(OR(E4=\"\",F4=\"\"),\"\",F4-E4+1)","v":""},{"$f":"IF(OR(F4=\"\",G4=\"\"),\"\",IF(C4=\"\",\"\",G4*D4*C4))","v":""}]
[null,null,{"$f":"IF(B5<>\"\",VLOOKUP(B5,Lijsten!$M$3:$N$13,2,FALSE),\"\")","v":""},null,{"$f":"IF(ISBLANK(B5),\"\",Startpagina!$C$13)","v":""},{"$f":"IF(ISBLANK(B5),\"\",Startpagina!$C$14)","v":""},{"$f":"IF(OR(E5=\"\",F5=\"\"),\"\",F5-E5+1)","v":""},{"$f":"IF(OR(F5=\"\",G5=\"\"),\"\",IF(C5=\"\",\"\",G5*D5*C5))","v":""}]
[null,null,{"$f":"IF(B6<>\"\",VLOOKUP(B6,Lijsten!$M$3:$N$13,2,FALSE),\"\")","v":""},null,{"$f":"IF(ISBLANK(B6),\"\",Startpagina!$C$13)","v":""},{"$f":"IF(ISBLANK(B6),\"\",Startpagina!$C$14)","v":""},"",""]
[null,null,{"$f":"IF(B7<>\"\",VLOOKUP(B7,Lijsten!$M$3:$N$13,2,FALSE),\"\")","v":""},null,{"$f":"IF(ISBLANK(B7),\"\",Startpagina!$C$13)","v":""},{"$f":"IF(ISBLANK(B7),\"\",Startpagina!$C$14)","v":""},"",""]
[null,null,{"$f":"IF(B8<>\"\",VLOOKUP(B8,Lijsten!$M$3:$N$13,2,FALSE),\"\")","v":""},null,{"$f":"IF(ISBLANK(B8),\"\",Startpagina!$C$13)","v":""},{"$f":"IF(ISBLANK(B8),\"\",Startpagina!$C$14)","v":""},"",""]
[null,null,{"$f":"IF(B9<>\"\",VLOOKUP(B9,Lijsten!$M$3:$N$13,2,FALSE),\"\")","v":""},null,{"$f":"IF(ISBLANK(B9),\"\",Startpagina!$C$13)","v":""},{"$f":"IF(ISBLANK(B9),\"\",Startpagina!$C$14)","v":""},"",""]
[null,null,{"$f":"IF(B10<>\"\",VLOOKUP(B10,Lijsten!$M$3:$N$13,2,FALSE),\"\")","v":""},null,{"$f":"IF(ISBLANK(B10),\"\",Startpagina!$C$13)","v":""},{"$f":"IF(ISBLANK(B10),\"\",Startpagina!$C$14)","v":""},"",""]
[null,null,{"$f":"IF(B11<>\"\",VLOOKUP(B11,Lijsten!$M$3:$N$13,2,FALSE),\"\")","v":""},null,{"$f":"IF(ISBLANK(B11),\"\",Startpagina!$C$13)","v":""},{"$f":"IF(ISBLANK(B11),\"\",Startpagina!$C$14)","v":""},"",""]
[null,null,{"$f":"IF(B12<>\"\",VLOOKUP(B12,Lijsten!$M$3:$N$13,2,FALSE),\"\")","v":""},null,{"$f":"IF(ISBLANK(B12),\"\",Startpagina!$C$13)","v":""},{"$f":"IF(ISBLANK(B12),\"\",Startpagina!$C$14)","v":""},"",""]
[null,null,{"$f":"IF(B13<>\"\",VLOOKUP(B13,Lijsten!$M$3:$N$13,2,FALSE),\"\")","v":""},null,{"$f":"IF(ISBLANK(B13),\"\",Startpagina!$C$13)","v":""},{"$f":"IF(ISBLANK(B13),\"\",Startpagina!$C$14)","v":""},"",""]
[null,null,{"$f":"IF(B14<>\"\",VLOOKUP(B14,Lijsten!$M$3:$N$13,2,FALSE),\"\")","v":""},null,{"$f":"IF(ISBLANK(B14),\"\",Startpagina!$C$13)","v":""},{"$f":"IF(ISBLANK(B14),\"\",Startpagina!$C$14)","v":""},"",""]
[null,null,{"$f":"IF(B15<>\"\",VLOOKUP(B15,Lijsten!$M$3:$N$13,2,FALSE),\"\")","v":""},null,{"$f":"IF(ISBLANK(B15),\"\",Startpagina!$C$13)","v":""},{"$f":"IF(ISBLANK(B15),\"\",Startpagina!$C$14)","v":""},"",""]
[null,null,{"$f":"IF(B16<>\"\",VLOOKUP(B16,Lijsten!$M$3:$N$13,2,FALSE),\"\")","v":""},null,{"$f":"IF(ISBLANK(B16),\"\",Startpagina!$C$13)","v":""},{"$f":"IF(ISBLANK(B16),\"\",Startpagina!$C$14)","v":""},"",""]
[null,null,{"$f":"IF(B17<>\"\",VLOOKUP(B17,Lijsten!$M$3:$N$13,2,FALSE),\"\")","v":""},null,{"$f":"IF(ISBLANK(B17),\"\",Startpagina!$C$13)","v":""},{"$f":"IF(ISBLANK(B17),\"\",Startpagina!$C$14)","v":""},"",""]
[null,null,{"$f":"IF(B18<>\"\",VLOOKUP(B18,Lijsten!$M$3:$N$13,2,FALSE),\"\")","v":""},null,{"$f":"IF(ISBLANK(B18),\"\",Startpagina!$C$13)","v":""},{"$f":"IF(ISBLANK(B18),\"\",Startpagina!$C$14)","v":""},"",""]
[]
[]
[]
[]
[]
[]
[]
[]
[]
[]
[]
[]
[]
[]
[]
[]
[]
[]
[]
[]
[]
[]
[]
[]
[]
[]
[]
[]
[]
[]
[]
[]
[]
[]
[]
[]
[]
[]
[]
[]
[]
[]
[]
[]
[]
[]
[]
[]
[]
[]
[]
[]
[]
[]
[]
[]
[]
[]
[]
[]
[]
[]
[]
[]
[]
[]
[]
[]
[]
[]
[]
[]
[]
[]
[]
[]
[]
[]
[]
[]
[]
[]
[]
[]
[]
[]
[]
[]
[]
[]
[]
[]
[]
[]
[]
[]
[]
[]
[]
[]
[]
[]
[]
[]
[]
[]
[]
[]
[]
[]
[]
[]
[]
[]
[]
[]
[]
[]
[]
[]
[]
[]
[]
[]
[]
[]
[]
[]
[]
[]
[]
[]
[]
[]
[]
[]
[]
[]
[]
[]
[]
[]
[]
[]
[]
[]
[]
[]
[]
[]
[]
[]
[]
[]
[]
[]
[]
[]
[]
[]
[]
[]
[]
[]
[]
[]
[]
[]
[]
[]
[]
[]
[]
[]
[]
[]
[]
[]
[]
[]
[]
[]
[]
[]
[]
[]
[]
[]
[]
[]
[]
[]
[]
[]
[]
[]
[]
[]
[]
[]
[]
[]
[]
[]
[]
[]
[]
[]
[]
[]
[]
[]
[]
[]
[]
[]
[]
[]
[]
[]
[]
[]
[]
[]
[]
[]
[]
[]
[]
[]
[]
[]
[]
[]
[]
[]
[]
[]
[]
[]
[]
[]
[]
[]
[]
[]
[]
[]
[]
[]
[]
[]
[]
[]
[]
[]
[]
[]
[]
[]
[]
[]
[]
[]
[]
[]
[]
[]
[]
[]
[]
[]
[]
[]
[]
[]
[]
[]
[]
[]
[]
[]
[]
[]
[]
[]
[]
[]
[]
[]
[]
[]
[]
[]
[]
[]
[]
[]
[]
[]
[]
[]
[]
[]
[]
[]
[]
[]
[]
[]
[]
[]
[]
[]
[]
[]
[]
[]
[]
[]
[]
[]
[]
[]
[]
[]
[]
[]
[]
[]
[]
[]
[]
[]
[]
[]
[]
[]
[]
[]
[]
[]
[]
[]
[]
[]
[]
[]
[]
[]
[]
[]
[]
[]
[]
[]
[]
[]
[]
[]
[]
[]
[]
[]
[]
[]
[]
[]
[]
[]
[]
[]
[]
[]
[]
[]
[]
[]
[]
[]
[]
[]
[]
[]
[]
[]
[]
[]
[]
[]
[]
[]
[]
[]
[]
[]
[]
[]
[]
[]
[]
[]
[]
[]
[]
[]
[]
[]
[]
[]
[]
[]
[]
[]
[]
[]
[]
[]
[]
[]
[]
[]
[]
[]
[]
[]
[]
[]
[]
[]
[]
[]
[]
[]
[]
[]
[]
[]
[]
[]
[]
[]
[]
[]
[]
[]
[]
[]
[]
[]
[]
[]
[]
[]
[]
[]
[]
[]
[]
[]
[]
[]
[]
[]
[]
[]
[]
[]
[]
[]
[]
[]
[]
[]
[]
[]
[]
[]
[]
[]
[]
[]
[]
[]
[]
[]
[]
[]
[]
[]
[]
[]
[]
[]
[]
[]
[]
[]
[]
[]
[]
[]
[]
[]
[]
[]
[]
[]
[]
[]
[]
[]
[]
[]
[]
[]
[]
[]
[]
[]
[]
[]
[]
[]
[]
[]
[]
[]
[]
[]
[]
[]
[]
[]
[]
[]
[]
[]
[]
[]
[]
[]
[]
[]
[]
[]
[]
[]
[]
[]
[]
[]
[]
[]
[]
[]
[]
[]
[]
[]
[]
[]
[]
[]
[]
[]
[]
[]
[]
[]
[]
[]
[]
[]
[]
[]
[]
[]
[]
[]
[]
[]
[]
[]
[]
[]
[]
[]
[]
[]
[]
[]
[]
[]
[]
[]
[]
[]
[]
[]
[]
[]
[]
[]
[]
[]
[]
[]
[]
[]
[]
[]
[]
[]
[]
[]
[]
[]
[]
[]
[]
[]
[]
[]
[]
[]
[]
[]
[]
[]
[]
[]
[]
[]
[]
[]
[]
[]
[]
[]
[]
[]
[]
[]
[]
[]
[]
[]
[]
[]
[]
[]
[]
[]
[]
[]
[]
[]
[]
[]
[]
[]
[]
[]
[]
[]
[]
[]
[]
[]
[]
[]
[]
[]
[]
[]
[]
[]
[]
[]
[]
[]
[]
[]
[]
[]
[]
[]
[]
[]
[]
[]
[]
[]
[]
[]
[]
[]
[]
[]
[]
[]
[]
[]
[]
[]
[]
[]
[]
[]
[]
[]
[]
[]
[]
[]
[]
[]
[]
[]
[]
[]
[]
[]
[]
[]
[]
[]
[]
[]
[]
[]
[]
[]
[]
[]
[]
[]
[]
[]
[]
[]
[]
[]
[]
[]
[]
[]
[]
[]
[]
[]
[]
[]
[]
[]
[]
[]
[]
[]
[]
[]
[]
[]
[]
[]
[]
[]
[]
[]
[]
[]
[]
[]
[]
[]
[]
[]
[]
[]
[]
[]
[]
[]
[]
[]
[]
[]
[]
[]
[]
[]
[]
[]
[]
[]
[]
[]
[]
[]
[]
[]
[]
[]
[]
[]
[]
[]
[]
[]
[]
[]
[]
[]
[]
[]
[]
[]
[]
[]
[]
[]
[]
[]
[]
[]
[]
[]
[]
[]
[]
[]
[]
[]
[]
[]
[]
[]
[]
[]
[]
[]
[]
[]
[]
[]
[]
[]
[]
[]
[]
[]
[]
[]
[]
[]
[]
[]
[]
[]
[]
[]
[]
[]
[]
[]
[]
[]
[]
[]
[]
[]
[]
[]
[]
[]
[]
[]
[]
[]
[]
[]
[]
[]
[]
[]
[]
[]
[]
[]
[]
[]
[]
[]
[]
[]
[]
[]
[]
[]
[]
[]
[]
[]
[]
[]
[]
[]
[]
[]
[]
[]
[]
[]
[]
[]
[]
[]
[]
[]
[]
[]
[]
[]
[]
[]
[]
[]
[]
[]
[]
[]
[]
[]
[]
[]
[]
[]
[]
[]
[]
[]
[]
[]
[]
[]
[]
[]
[]
[]
[]
[]
[]
[]
[]
[]
[]
[]
[]
[]
[]
[]
[]
[]
[]
[]
[]
[]
[]
[]
[]
[]
[]
[]
[]
[]
[]
[]
[]
[]
[]
[]
[]
[]
[]
[]
[]
[]
[]
[]
[]
[]
[]
[]
[]
[]
[]
[]
[]
[]
[]
[]
[]
[]
[]
[]
[]
[]
[]
[]
[]
[]
[]
[]
[]
[]
[]
[]
[]
[]
[]
[]
[]
[]
[]
[]
[]
[]
[]
[]
[]
[]
[]
[]
[]
[]
[]
[]
[]
[]
[]
[]
[]
[]
[]
[]
[]
[]
[]
[]
[]
[]
[]
[]
[]
[]
[]
[]
[]
[]
[]
[]
[]
[]
[]
[]
[]
[]
[]
[]
[]
[]
[]
[]
[]
[]
[]
[]
[]
[]
[]
[]
[]
[]
[]
[]
[]
[]
[]
[]
[]
[]
[]
[]
[]
[]
[]
[]
[]
[]
[]
[]
[]
[]
[]
[]
[]
[]
[]
[]
[]
[]
[]
[]
[]
[]
[]
[]
[]
[]
[]
[]
[]
[]
[]
[]
[]
[]
[]
[]
[]
[]
[]
[]
[]
[]
[]
[]
[]
[]
[]
[]
[]
[]
[]
[]
[]
[]
[]
[]
[]
[]
[]
[]
[]
[]
[]
[]
[]
[]
[]
[]
[]
[]
[]
[]
[]
[]
[]
[]
[]
[]
[]
[]
[]
[]
[]
[]
[]
[]
[]
[]
[]
[]
[]
[]
[]
[]
[]
[]
[]
[]
[]
[]
[]
[]
[]
[]
[]
[]
[]
[]
[]
[]
[]
[]
[]
[]
[]
[]
[]
[]
[]
[]
[]
[]
[]
[]
[]
[]
[]
[]
[]
[]
[]
[]
[]
[]
[]
[]
[]
[]
[]
[]
[]
[]
[]
[]
[]
[]
[]
[]
[]
[]
[]
[]
[]
[]
[]
[]
[]
[]
[]
[]
[]
[]
[]
[]
[]
[]
[]
[]
[]
[]
[]
[]
[]
[]
[]
[]
[]
[]
[]
[]
[]
[]
[]
[]
[]
[]
[]
[]
[]
[]
[]
[]
[]
[]
[]
[]
[]
[]
[]
[]
[]
[]
[]
[]
[]
[]
[]
[]
[]
[]
[]
[]
[]
[]
[]
[]
[]
[]
[]
[]
[]
[]
[]
[]
[]
[]
[]
[]
[]
[]
[]
[]
[]
[]
[]
[]
[]
[]
[]
[]
[]
[]
[]
[]
[]
[]
[]
[]
[]
[]
[]
[]
[]
[]
[]
[]
[]
[]
[]
[]
[]
[]
[]
[]
[]
[]
[]
[]
[]
[]
[]
[]
[]
[]
[]
[]
[]
[]
[]
[]
[]
[]
[]
[]
[]
[]
[]
[]
[]
[]
[]
[]
[]
[]
[]
[]
[]
[]
[]
[]
[]
[]
[]
[]
[]
[]
[]
[]
[]
[]
[]
[]
[]
[]
[]
[]
[]
[]
[]
[]
[]
[]
[]
[]
[]
[]
[]
[]
[]
[]
[]
[]
[]
[]
[]
[]
[]
[]
[]
[]
[]
[]
[]
[]
[]
[]
[]
[]
[]
[]
[]
[]
[]
[]
[]
[]
[]
[]
[]
[]
[]
[]
[]
[]
[]
[]
[]
[]
[]
[]
[]
[]
[]
[]
[]
[]
[]
[]
[]
[]
[]
[]
[]
[]
[]
[]
[]
[]
[]
[]
[]
[]
[]
[]
[]
[]
[]
[]
[]
[]
[]
[]
[]
[]
[]
[]
[]
[]
[]
[]
[]
[]
[]
[]
[]
[]
[]
[]
[]
[]
[]
[]
[]
[]
[]
[]
[]
[]
[]
[]
[]
[]
[]
[]
[]
[]
[]
[]
[]
[]
[]
[]
[]
[]
[]
[]
[]
[]
[]
[]
[]
[]
[]
[]
[]
[]
[]
[]
[]
[]
[]
[]
[]
[]
[]
[]
[]
[]
[]
[]
[]
[]
[]
[]
[null,null,{"$f":"IF(B1587<>\"\",VLOOKUP(B1587,Lijsten!$M$3:$N$12,2,FALSE),\"\")","v":""},null,null,null,{"$f":"IF(OR(E1587=\"\",F1587=\"\"),\"\",F1587-E1587+1)","v":""},{"$f":"IF(OR(F1587=\"\",G1587=\"\"),\"\",IF(C1587=\"\",\"\",G1587*D1587*C1587))","v":""}]
[null,null,{"$f":"IF(B1588<>\"\",VLOOKUP(B1588,Lijsten!$M$3:$N$12,2,FALSE),\"\")","v":""},null,null,null,"",""]
[null,null,{"$f":"IF(B1589<>\"\",VLOOKUP(B1589,Lijsten!$M$3:$N$12,2,FALSE),\"\")","v":""},null,null,null,"",""]
[null,null,{"$f":"IF(B1590<>\"\",VLOOKUP(B1590,Lijsten!$M$3:$N$12,2,FALSE),\"\")","v":""},null,null,null,"",""]
[null,null,{"$f":"IF(B1591<>\"\",VLOOKUP(B1591,Lijsten!$M$3:$N$12,2,FALSE),\"\")","v":""},null,null,null,"",""]
[null,null,{"$f":"IF(B1592<>\"\",VLOOKUP(B1592,Lijsten!$M$3:$N$12,2,FALSE),\"\")","v":""},null,null,null,"",""]
[null,null,{"$f":"IF(B1593<>\"\",VLOOKUP(B1593,Lijsten!$M$3:$N$12,2,FALSE),\"\")","v":""},null,null,null,"",""]
[null,null,{"$f":"IF(B1594<>\"\",VLOOKUP(B1594,Lijsten!$M$3:$N$12,2,FALSE),\"\")","v":""},null,null,null,"",""]
[null,null,{"$f":"IF(B1595<>\"\",VLOOKUP(B1595,Lijsten!$M$3:$N$12,2,FALSE),\"\")","v":""},null,null,null,"",""]
[null,null,{"$f":"IF(B1596<>\"\",VLOOKUP(B1596,Lijsten!$M$3:$N$12,2,FALSE),\"\")","v":""},null,null,null,"",""]
[null,null,{"$f":"IF(B1597<>\"\",VLOOKUP(B1597,Lijsten!$M$3:$N$12,2,FALSE),\"\")","v":""},null,null,null,"",""]
[null,null,{"$f":"IF(B1598<>\"\",VLOOKUP(B1598,Lijsten!$M$3:$N$12,2,FALSE),\"\")","v":""},null,null,null,"",""]
[null,null,{"$f":"IF(B1599<>\"\",VLOOKUP(B1599,Lijsten!$M$3:$N$12,2,FALSE),\"\")","v":""},null,null,null,"",""]
[null,null,{"$f":"IF(B1600<>\"\",VLOOKUP(B1600,Lijsten!$M$3:$N$12,2,FALSE),\"\")","v":""},null,null,null,"",""]
[null,null,{"$f":"IF(B1601<>\"\",VLOOKUP(B1601,Lijsten!$M$3:$N$12,2,FALSE),\"\")","v":""},null,null,null,"",""]
[null,null,{"$f":"IF(B1602<>\"\",VLOOKUP(B1602,Lijsten!$M$3:$N$12,2,FALSE),\"\")","v":""},null,null,null,"",""]
[null,null,{"$f":"IF(B1603<>\"\",VLOOKUP(B1603,Lijsten!$M$3:$N$12,2,FALSE),\"\")","v":""},null,null,null,"",""]
[null,null,{"$f":"IF(B1604<>\"\",VLOOKUP(B1604,Lijsten!$M$3:$N$12,2,FALSE),\"\")","v":""},null,null,null,"",""]
[null,null,{"$f":"IF(B1605<>\"\",VLOOKUP(B1605,Lijsten!$M$3:$N$12,2,FALSE),\"\")","v":""},null,null,null,"",""]
[null,null,{"$f":"IF(B1606<>\"\",VLOOKUP(B1606,Lijsten!$M$3:$N$12,2,FALSE),\"\")","v":""},null,null,null,"",""]
[null,null,{"$f":"IF(B1607<>\"\",VLOOKUP(B1607,Lijsten!$M$3:$N$12,2,FALSE),\"\")","v":""},null,null,null,"",""]
[null,null,{"$f":"IF(B1608<>\"\",VLOOKUP(B1608,Lijsten!$M$3:$N$12,2,FALSE),\"\")","v":""},null,null,null,"",""]
[null,null,{"$f":"IF(B1609<>\"\",VLOOKUP(B1609,Lijsten!$M$3:$N$12,2,FALSE),\"\")","v":""},null,null,null,{"$f":"IF(OR(E1609=\"\",F1609=\"\"),\"\",F1609-E1609+1)","v":""},{"$f":"IF(OR(F1609=\"\",G1609=\"\"),\"\",IF(C1609=\"\",\"\",G1609*D1609*C1609))","v":""}]
[null,null,{"$f":"IF(B1610<>\"\",VLOOKUP(B1610,Lijsten!$M$3:$N$12,2,FALSE),\"\")","v":""},null,null,null,"",""]
[null,null,{"$f":"IF(B1611<>\"\",VLOOKUP(B1611,Lijsten!$M$3:$N$12,2,FALSE),\"\")","v":""},null,null,null,"",""]
[null,null,{"$f":"IF(B1612<>\"\",VLOOKUP(B1612,Lijsten!$M$3:$N$12,2,FALSE),\"\")","v":""},null,null,null,"",""]
[null,null,{"$f":"IF(B1613<>\"\",VLOOKUP(B1613,Lijsten!$M$3:$N$12,2,FALSE),\"\")","v":""},null,null,null,"",""]
[null,null,{"$f":"IF(B1614<>\"\",VLOOKUP(B1614,Lijsten!$M$3:$N$12,2,FALSE),\"\")","v":""},null,null,null,"",""]
[null,null,{"$f":"IF(B1615<>\"\",VLOOKUP(B1615,Lijsten!$M$3:$N$12,2,FALSE),\"\")","v":""},null,null,null,"",""]
[null,null,{"$f":"IF(B1616<>\"\",VLOOKUP(B1616,Lijsten!$M$3:$N$12,2,FALSE),\"\")","v":""},null,null,null,"",""]
[null,null,{"$f":"IF(B1617<>\"\",VLOOKUP(B1617,Lijsten!$M$3:$N$12,2,FALSE),\"\")","v":""},null,null,null,"",""]
[null,null,{"$f":"IF(B1618<>\"\",VLOOKUP(B1618,Lijsten!$M$3:$N$12,2,FALSE),\"\")","v":""},null,null,null,"",""]
[null,null,{"$f":"IF(B1619<>\"\",VLOOKUP(B1619,Lijsten!$M$3:$N$12,2,FALSE),\"\")","v":""},null,null,null,"",""]
[null,null,{"$f":"IF(B1620<>\"\",VLOOKUP(B1620,Lijsten!$M$3:$N$12,2,FALSE),\"\")","v":""},null,null,null,"",""]
[null,null,{"$f":"IF(B1621<>\"\",VLOOKUP(B1621,Lijsten!$M$3:$N$12,2,FALSE),\"\")","v":""},null,null,null,"",""]
[null,null,{"$f":"IF(B1622<>\"\",VLOOKUP(B1622,Lijsten!$M$3:$N$12,2,FALSE),\"\")","v":""},null,null,null,"",""]
[null,null,{"$f":"IF(B1623<>\"\",VLOOKUP(B1623,Lijsten!$M$3:$N$12,2,FALSE),\"\")","v":""},null,null,null,"",""]
[null,null,{"$f":"IF(B1624<>\"\",VLOOKUP(B1624,Lijsten!$M$3:$N$12,2,FALSE),\"\")","v":""},null,null,null,"",""]
[null,null,{"$f":"IF(B1625<>\"\",VLOOKUP(B1625,Lijsten!$M$3:$N$12,2,FALSE),\"\")","v":""},null,null,null,"",""]
[null,null,{"$f":"IF(B1626<>\"\",VLOOKUP(B1626,Lijsten!$M$3:$N$12,2,FALSE),\"\")","v":""},null,null,null,"",""]
[null,null,{"$f":"IF(B1627<>\"\",VLOOKUP(B1627,Lijsten!$M$3:$N$12,2,FALSE),\"\")","v":""},null,null,null,"",""]
[null,null,{"$f":"IF(B1628<>\"\",VLOOKUP(B1628,Lijsten!$M$3:$N$12,2,FALSE),\"\")","v":""},null,null,null,"",""]
[null,null,{"$f":"IF(B1629<>\"\",VLOOKUP(B1629,Lijsten!$M$3:$N$12,2,FALSE),\"\")","v":""},null,null,null,"",""]
[null,null,{"$f":"IF(B1630<>\"\",VLOOKUP(B1630,Lijsten!$M$3:$N$12,2,FALSE),\"\")","v":""},null,null,null,"",""]
[null,null,{"$f":"IF(B1631<>\"\",VLOOKUP(B1631,Lijsten!$M$3:$N$12,2,FALSE),\"\")","v":""},null,null,null,"",""]
[null,null,{"$f":"IF(B1632<>\"\",VLOOKUP(B1632,Lijsten!$M$3:$N$12,2,FALSE),\"\")","v":""},null,null,null,"",""]
[null,null,{"$f":"IF(B1633<>\"\",VLOOKUP(B1633,Lijsten!$M$3:$N$12,2,FALSE),\"\")","v":""},null,null,null,"",""]
[null,null,{"$f":"IF(B1634<>\"\",VLOOKUP(B1634,Lijsten!$M$3:$N$12,2,FALSE),\"\")","v":""},null,null,null,"",""]

{"sheet":"Interval","index":3,"n_rows":1293,"n_cols":11,"rows_kept":1293,"cut":false,"hidden":false,"merged":[]}
[null,"Datum IBN",{"$f":"Startpagina!C13","v":"00:00:00"},null,null,null,null,null,null,null,"TOTAAL"]
[null,"Dieren per Interval",null,null,null,null,null,null,null,null,{"$f":"SUM(J:J)","v":0}]
[null,"In/Uitheems","Diersoort","Aantal",null,"Bedrag per interval","Datum in","Datum uit","Aantal dagen","Totaal","Commentaar"]
[null,null,null,null,{"$f":"IF(LEN(D4)=0,\"\",B4&C4&TEXT(D4,\"0000\"))","v":""},{"$f":"IF(ISNA(VLOOKUP(B4&C4,Prices!$I$2:$I$546,8,FALSE)),\"\",VLOOKUP(E4,Prices!$B$2:$C$546,2,TRUE))","v":""},{"$f":"IF(ISBLANK(B4),\"\",Startpagina!$C$13)","v":""},{"$f":"IF(ISBLANK(B4),\"\",Startpagina!$C$14)","v":""},{"$f":"IF(OR(G4=\"\",H4=\"\"),\"\",H4-G4+1)","v":""},{"$f":"IF(ISNUMBER(F4*I4),F4*I4,\"\")","v":""}]
[null,null,null,null,{"$f":"IF(LEN(D5)=0,\"\",B5&C5&TEXT(D5,\"0000\"))","v":""},{"$f":"IF(ISNA(VLOOKUP(B5&C5,Prices!$I$2:$I$546,8,FALSE)),\"\",VLOOKUP(E5,Prices!$B$2:$C$546,2,TRUE))","v":""},{"$f":"IF(ISBLANK(B5),\"\",Startpagina!$C$13)","v":""},{"$f":"IF(ISBLANK(B5),\"\",Startpagina!$C$14)","v":""},{"$f":"IF(OR(G5=\"\",H5=\"\"),\"\",H5-G5+1)","v":""},{"$f":"IF(ISNUMBER(F5*I5),F5*I5,\"\")","v":""}]
[null,null,null,null,"",{"$f":"IF(ISNA(VLOOKUP(B6&C6,Prices!$I$2:$I$546,8,FALSE)),\"\",VLOOKUP(E6,Prices!$B$2:$C$546,2,TRUE))","v":""},{"$f":"IF(ISBLANK(B6),\"\",Startpagina!$C$13)","v":""},{"$f":"IF(ISBLANK(B6),\"\",Startpagina!$C$14)","v":""},"",""]
[null,null,null,null,"",{"$f":"IF(ISNA(VLOOKUP(B7&C7,Prices!$I$2:$I$546,8,FALSE)),\"\",VLOOKUP(E7,Prices!$B$2:$C$546,2,TRUE))","v":""},{"$f":"IF(ISBLANK(B7),\"\",Startpagina!$C$13)","v":""},{"$f":"IF(ISBLANK(B7),\"\",Startpagina!$C$14)","v":""},"",""]
[null,null,null,null,"",{"$f":"IF(ISNA(VLOOKUP(B8&C8,Prices!$I$2:$I$546,8,FALSE)),\"\",VLOOKUP(E8,Prices!$B$2:$C$546,2,TRUE))","v":""},{"$f":"IF(ISBLANK(B8),\"\",Startpagina!$C$13)","v":""},{"$f":"IF(ISBLANK(B8),\"\",Startpagina!$C$14)","v":""},"",""]
[null,null,null,null,"",{"$f":"IF(ISNA(VLOOKUP(B9&C9,Prices!$I$2:$I$546,8,FALSE)),\"\",VLOOKUP(E9,Prices!$B$2:$C$546,2,TRUE))","v":""},{"$f":"IF(ISBLANK(B9),\"\",Startpagina!$C$13)","v":""},{"$f":"IF(ISBLANK(B9),\"\",Startpagina!$C$14)","v":""},"",""]
[null,null,null,null,"",{"$f":"IF(ISNA(VLOOKUP(B10&C10,Prices!$I$2:$I$546,8,FALSE)),\"\",VLOOKUP(E10,Prices!$B$2:$C$546,2,TRUE))","v":""},{"$f":"IF(ISBLANK(B10),\"\",Startpagina!$C$13)","v":""},{"$f":"IF(ISBLANK(B10),\"\",Startpagina!$C$14)","v":""},"",""]
[null,null,null,null,"",{"$f":"IF(ISNA(VLOOKUP(B11&C11,Prices!$I$2:$I$546,8,FALSE)),\"\",VLOOKUP(E11,Prices!$B$2:$C$546,2,TRUE))","v":""},{"$f":"IF(ISBLANK(B11),\"\",Startpagina!$C$13)","v":""},{"$f":"IF(ISBLANK(B11),\"\",Startpagina!$C$14)","v":""},"",""]
[null,null,null,null,"",{"$f":"IF(ISNA(VLOOKUP(B12&C12,Prices!$I$2:$I$546,8,FALSE)),\"\",VLOOKUP(E12,Prices!$B$2:$C$546,2,TRUE))","v":""},{"$f":"IF(ISBLANK(B12),\"\",Startpagina!$C$13)","v":""},{"$f":"IF(ISBLANK(B12),\"\",Startpagina!$C$14)","v":""},"",""]
[null,null,null,null,"",{"$f":"IF(ISNA(VLOOKUP(B13&C13,Prices!$I$2:$I$546,8,FALSE)),\"\",VLOOKUP(E13,Prices!$B$2:$C$546,2,TRUE))","v":""},{"$f":"IF(ISBLANK(B13),\"\",Startpagina!$C$13)","v":""},{"$f":"IF(ISBLANK(B13),\"\",Startpagina!$C$14)","v":""},"",""]
[null,null,null,null,"",{"$f":"IF(ISNA(VLOOKUP(B14&C14,Prices!$I$2:$I$546,8,FALSE)),\"\",VLOOKUP(E14,Prices!$B$2:$C$546,2,TRUE))","v":""},{"$f":"IF(ISBLANK(B14),\"\",Startpagina!$C$13)","v":""},{"$f":"IF(ISBLANK(B14),\"\",Startpagina!$C$14)","v":""},"",""]
[null,null,null,null,"",{"$f":"IF(ISNA(VLOOKUP(B15&C15,Prices!$I$2:$I$546,8,FALSE)),\"\",VLOOKUP(E15,Prices!$B$2:$C$546,2,TRUE))","v":""},{"$f":"IF(ISBLANK(B15),\"\",Startpagina!$C$13)","v":""},{"$f":"IF(ISBLANK(B15),\"\",Startpagina!$C$14)","v":""},"",""]
[null,null,null,null,"",{"$f":"IF(ISNA(VLOOKUP(B16&C16,Prices!$I$2:$I$546,8,FALSE)),\"\",VLOOKUP(E16,Prices!$B$2:$C$546,2,TRUE))","v":""},{"$f":"IF(ISBLANK(B16),\"\",Startpagina!$C$13)","v":""},{"$f":"IF(ISBLANK(B16),\"\",Startpagina!$C$14)","v":""},"",""]
[null,null,null,null,"",{"$f":"IF(ISNA(VLOOKUP(B17&C17,Prices!$I$2:$I$546,8,FALSE)),\"\",VLOOKUP(E17,Prices!$B$2:$C$546,2,TRUE))","v":""},{"$f":"IF(ISBLANK(B17),\"\",Startpagina!$C$13)","v":""},{"$f":"IF(ISBLANK(B17),\"\",Startpagina!$C$14)","v":""},"",""]
[null,null,null,null,"",{"$f":"IF(ISNA(VLOOKUP(B18&C18,Prices!$I$2:$I$546,8,FALSE)),\"\",VLOOKUP(E18,Prices!$B$2:$C$546,2,TRUE))","v":""},{"$f":"IF(ISBLANK(B18),\"\",Startpagina!$C$13)","v":""},{"$f":"IF(ISBLANK(B18),\"\",Startpagina!$C$14)","v":""},"",""]
[]
[]
[]
[]
[]
[]
[]
[]
[]
[]
[]
[]
[]
[]
[]
[]
[]
[]
[]
[]
[]
[]
[]
[]
[]
[]
[]
[]
[]
[]
[]
[]
[]
[]
[]
[]
[]
[]
[]
[]
[]
[]
[]
[]
[]
[]
[]
[]
[]
[]
[]
[]
[]
[]
[]
[]
[]
[]
[]
[]
[]
[]
[]
[]
[]
[]
[]
[]
[]
[]
[]
[]
[]
[]
[]
[]
[]
[]
[]
[]
[]
[]
[]
[]
[]
[]
[]
[]
[]
[]
[]
[]
[]
[]
[]
[]
[]
[]
[]
[]
[]
[]
[]
[]
[]
[]
[]
[]
[]
[]
[]
[]
[]
[]
[]
[]
[]
[]
[]
[]
[]
[]
[]
[]
[]
[]
[]
[]
[]
[]
[]
[]
[]
[]
[]
[]
[]
[]
[]
[]
[]
[]
[]
[]
[]
[]
[]
[]
[]
[]
[]
[]
[]
[]
[]
[]
[]
[]
[]
[]
[]
[]
[]
[]
[]
[]
[]
[]
[]
[]
[]
[]
[]
[]
[]
[]
[]
[]
[]
[]
[]
[]
[]
[]
[]
[]
[]
[]
[]
[]
[]
[]
[]
[]
[]
[]
[]
[]
[]
[]
[]
[]
[]
[]
[]
[]
[]
[]
[]
[]
[]
[]
[]
[]
[]
[]
[]
[]
[]
[]
[]
[]
[]
[]
[]
[]
[]
[]
[]
[]
[]
[]
[]
[]
[]
[]
[]
[]
[]
[]
[]
[]
[]
[]
[]
[]
[]
[]
[]
[]
[]
[]
[]
[]
[]
[]
[]
[]
[]
[]
[]
[]
[]
[]
[]
[]
[]
[]
[]
[]
[]
[]
[]
[]
[]
[]
[]
[]
[]
[]
[]
[]
[]
[]
[]
[]
[]
[]
[]
[]
[]
[]
[]
[]
[]
[]
[]
[]
[]
[]
[]
[]
[]
[]
[]
[]
[]
[]
[]
[]
[]
[]
[]
[]
[]
[]
[]
[]
[]
[]
[]
[]
[]
[]
[]
[]
[]
[]
[]
[]
[]
[]
[]
[]
[]
[]
[]
[]
[]
[]
[]
[]
[]
[]
[]
[]
[]
[]
[]
[]
[]
[]
[]
[]
[]
[]
[]
[]
[]
[]
[]
[]
[]
[]
[]
[]
[]
[]
[]
[]
[]
[]
[]
[]
[]
[]
[]
[]
[]
[]
[]
[]
[]
[]
[]
[]
[]
[]
[]
[]
[]
[]
[]
[]
[]
[]
[]
[]
[]
[]
[]
[]
[]
[]
[]
[]
[]
[]
[]
[]
[]
[]
[]
[]
[]
[]
[]
[]
[]
[]
[]
[]
[]
[]
[]
[]
[]
[]
[]
[]
[]
[]
[]
[]
[]
[]
[]
[]
[]
[]
[]
[]
[]
[]
[]
[]
[]
[]
[]
[]
[]
[]
[]
[]
[]
[]
[]
[]
[]
[]
[]
[]
[]
[]
[]
[]
[]
[]
[]
[]
[]
[]
[]
[]
[]
[]
[]
[]
[]
[]
[]
[]
[]
[]
[]
[]
[]
[]
[]
[]
[]
[]
[]
[]
[]
[]
[]
[]
[]
[]
[]
[]
[]
[]
[]
[]
[]
[]
[]
[]
[]
[]
[]
[]
[]
[]
[]
[]
[]
[]
[]
[]
[]
[]
[]
[]
[]
[]
[]
[]
[]
[]
[]
[]
[]
[]
[]
[]
[]
[]
[]
[]
[]
[]
[]
[]
[]
[]
[]
[]
[]
[]
[]
[]
[]
[]
[]
[]
[]
[]
[]
[]
[]
[]
[]
[]
[]
[]
[]
[]
[]
[]
[]
[]
[]
[]
[]
[]
[]
[]
[]
[]
[]
[]
[]
[]
[]
[]
[]
[]
[]
[]
[]
[]
[]
[]
[]
[]
[]
[]
[]
[]
[]
[]
[]
[]
[]
[]
[]
[]
[]
[]
[]
[]
[]
[]
[]
[]
[]
[]
[]
[]
[]
[]
[]
[]
[]
[]
[]
[]
[]
[]
[]
[]
[]
[]
[]
[]
[]
[]
[]
[]
[]
[]
[]
[]
[]
[]
[]
[]
[]
[]
[]
[]
[]
[]
[]
[]
[]
[]
[]
[]
[]
[]
[]
[]
[]
[]
[]
[]
[]
[]
[]
[]
[]
[]
[]
[]
[]
[]
[]
[]
[]
[]
[]
[]
[]
[]
[]
[]
[]
[]
[]
[]
[]
[]
[]
[]
[]
[]
[]
[]
[]
[]
[]
[]
[]
[]
[]
[]
[]
[]
[]
[]
[]
[]
[]
[]
[]
[]
[]
[]
[]
[]
[]
[]
[]
[]
[]
[]
[]
[]
[]
[]
[]
[]
[]
[]
[]
[]
[]
[]
[]
[]
[]
[]
[]
[]
[]
[]
[]
[]
[]
[]
[]
[]
[]
[]
[]
[]
[]
[]
[]
[]
[]
[]
[]
[]
[]
[]
[]
[]
[]
[]
[]
[]
[]
[]
[]
[]
[]
[]
[]
[]
[]
[]
[]
[]
[]
[]
[]
[]
[]
[]
[]
[]
[]
[]
[]
[]
[]
[]
[]
[]
[]
[]
[]
[]
[]
[]
[]
[]
[]
[]
[]
[]
[]
[]
[]
[]
[]
[]
[]
[]
[]
[]
[]
[]
[]
[]
[]
[]
[]
[]
[]
[]
[]
[]
[]
[]
[]
[]
[]
[]
[]
[]
[]
[]
[]
[]
[]
[]
[]
[]
[]
[]
[]
[]
[]
[]
[]
[]
[]
[]
[]
[]
[]
[]
[]
[]
[]
[]
[]
[]
[]
[]
[]
[]
[]
[]
[]
[]
[]
[]
[]
[]
[]
[]
[]
[]
[]
[]
[]
[]
[]
[]
[]
[]
[]
[]
[]
[]
[]
[]
[]
[]
[]
[]
[]
[]
[]
[]
[]
[]
[]
[]
[]
[]
[]
[]
[]
[]
[]
[]
[]
[]
[]
[]
[]
[]
[]
[]
[]
[]
[]
[]
[]
[]
[]
[]
[]
[]
[]
[]
[]
[]
[]
[]
[]
[]
[]
[]
[]
[]
[]
[]
[]
[]
[]
[]
[]
[]
[]
[]
[]
[]
[]
[]
[]
[]
[]
[]
[]
[]
[]
[]
[]
[]
[]
[]
[]
[]
[]
[]
[]
[]
[]
[]
[]
[]
[]
[]
[]
[]
[]
[]
[]
[]
[]
[]
[]
[]
[]
[]
[]
[]
[]
[]
[]
[]
[]
[]
[]
[]
[]
[]
[]
[]
[]
[]
[]
[]
[]
[]
[]
[]
[]
[]
[]
[]
[]
[]
[]
[]
[]
[]
[]
[]
[]
[null,null,null,null,{"$f":"IF(LEN(D1058)=0,\"\",C1058&TEXT(D1058,\"0000\"))","v":""},{"$f":"IF(ISNA(VLOOKUP(E1058,Prices!$B$2:$C$465,2,TRUE)),\"\",VLOOKUP(E1058,Prices!$B$2:$C$465,2,TRUE))","v":""},null,null,{"$f":"IF(OR(G1058=\"\",H1058=\"\"),\"\",H1058-G1058+1)","v":""},{"$f":"IF(ISNUMBER(F1058*I1058),F1058*I1058,\"\")","v":""}]
[null,null,null,null,"",{"$f":"IF(ISNA(VLOOKUP(E1059,Prices!$B$2:$C$465,2,TRUE)),\"\",VLOOKUP(E1059,Prices!$B$2:$C$465,2,TRUE))","v":""},null,null,"",""]
[null,null,null,null,"",{"$f":"IF(ISNA(VLOOKUP(E1060,Prices!$B$2:$C$465,2,TRUE)),\"\",VLOOKUP(E1060,Prices!$B$2:$C$465,2,TRUE))","v":""},null,null,"",""]
[null,null,null,null,"",{"$f":"IF(ISNA(VLOOKUP(E1061,Prices!$B$2:$C$465,2,TRUE)),\"\",VLOOKUP(E1061,Prices!$B$2:$C$465,2,TRUE))","v":""},null,null,"",""]
[null,null,null,null,"",{"$f":"IF(ISNA(VLOOKUP(E1062,Prices!$B$2:$C$465,2,TRUE)),\"\",VLOOKUP(E1062,Prices!$B$2:$C$465,2,TRUE))","v":""},null,null,"",""]
[null,null,null,null,"",{"$f":"IF(ISNA(VLOOKUP(E1063,Prices!$B$2:$C$465,2,TRUE)),\"\",VLOOKUP(E1063,Prices!$B$2:$C$465,2,TRUE))","v":""},null,null,"",""]
[null,null,null,null,"",{"$f":"IF(ISNA(VLOOKUP(E1064,Prices!$B$2:$C$465,2,TRUE)),\"\",VLOOKUP(E1064,Prices!$B$2:$C$465,2,TRUE))","v":""},null,null,"",""]
[null,null,null,null,"",{"$f":"IF(ISNA(VLOOKUP(E1065,Prices!$B$2:$C$465,2,TRUE)),\"\",VLOOKUP(E1065,Prices!$B$2:$C$465,2,TRUE))","v":""},null,null,"",""]
[null,null,null,null,"",{"$f":"IF(ISNA(VLOOKUP(E1066,Prices!$B$2:$C$465,2,TRUE)),\"\",VLOOKUP(E1066,Prices!$B$2:$C$465,2,TRUE))","v":""},null,null,"",""]
[null,null,null,null,"",{"$f":"IF(ISNA(VLOOKUP(E1067,Prices!$B$2:$C$465,2,TRUE)),\"\",VLOOKUP(E1067,Prices!$B$2:$C$465,2,TRUE))","v":""},null,null,"",""]
[null,null,null,null,"",{"$f":"IF(ISNA(VLOOKUP(E1068,Prices!$B$2:$C$465,2,TRUE)),\"\",VLOOKUP(E1068,Prices!$B$2:$C$465,2,TRUE))","v":""},null,null,"",""]
[null,null,null,null,"",{"$f":"IF(ISNA(VLOOKUP(E1069,Prices!$B$2:$C$465,2,TRUE)),\"\",VLOOKUP(E1069,Prices!$B$2:$C$465,2,TRUE))","v":""},null,null,"",""]
[null,null,null,null,"",{"$f":"IF(ISNA(VLOOKUP(E1070,Prices!$B$2:$C$465,2,TRUE)),\"\",VLOOKUP(E1070,Prices!$B$2:$C$465,2,TRUE))","v":""},null,null,"",""]
[null,null,null,null,"",{"$f":"IF(ISNA(VLOOKUP(E1071,Prices!$B$2:$C$465,2,TRUE)),\"\",VLOOKUP(E1071,Prices!$B$2:$C$465,2,TRUE))","v":""},null,null,"",""]
[null,null,null,null,"",{"$f":"IF(ISNA(VLOOKUP(E1072,Prices!$B$2:$C$465,2,TRUE)),\"\",VLOOKUP(E1072,Prices!$B$2:$C$465,2,TRUE))","v":""},null,null,"",""]
[null,null,null,null,"",{"$f":"IF(ISNA(VLOOKUP(E1073,Prices!$B$2:$C$465,2,TRUE)),\"\",VLOOKUP(E1073,Prices!$B$2:$C$465,2,TRUE))","v":""},null,null,"",""]
[null,null,null,null,"",{"$f":"IF(ISNA(VLOOKUP(E1074,Prices!$B$2:$C$465,2,TRUE)),\"\",VLOOKUP(E1074,Prices!$B$2:$C$465,2,TRUE))","v":""},null,null,"",""]
[null,null,null,null,"",{"$f":"IF(ISNA(VLOOKUP(E1075,Prices!$B$2:$C$465,2,TRUE)),\"\",VLOOKUP(E1075,Prices!$B$2:$C$465,2,TRUE))","v":""},null,null,"",""]
[null,null,null,null,"",{"$f":"IF(ISNA(VLOOKUP(E1076,Prices!$B$2:$C$465,2,TRUE)),\"\",VLOOKUP(E1076,Prices!$B$2:$C$465,2,TRUE))","v":""},null,null,"",""]
[null,null,null,null,"",{"$f":"IF(ISNA(VLOOKUP(E1077,Prices!$B$2:$C$465,2,TRUE)),\"\",VLOOKUP(E1077,Prices!$B$2:$C$465,2,TRUE))","v":""},null,null,"",""]
[null,null,null,null,"",{"$f":"IF(ISNA(VLOOKUP(E1078,Prices!$B$2:$C$465,2,TRUE)),\"\",VLOOKUP(E1078,Prices!$B$2:$C$465,2,TRUE))","v":""},null,null,"",""]
[null,null,null,null,"",{"$f":"IF(ISNA(VLOOKUP(E1079,Prices!$B$2:$C$465,2,TRUE)),\"\",VLOOKUP(E1079,Prices!$B$2:$C$465,2,TRUE))","v":""},null,null,"",""]
[null,null,null,null,"",{"$f":"IF(ISNA(VLOOKUP(E1080,Prices!$B$2:$C$465,2,TRUE)),\"\",VLOOKUP(E1080,Prices!$B$2:$C$465,2,TRUE))","v":""},null,null,"",""]
[null,null,null,null,"",{"$f":"IF(ISNA(VLOOKUP(E1081,Prices!$B$2:$C$465,2,TRUE)),\"\",VLOOKUP(E1081,Prices!$B$2:$C$465,2,TRUE))","v":""},null,null,"",""]
[null,null,null,null,"",{"$f":"IF(ISNA(VLOOKUP(E1082,Prices!$B$2:$C$465,2,TRUE)),\"\",VLOOKUP(E1082,Prices!$B$2:$C$465,2,TRUE))","v":""},null,null,"",""]
[null,null,null,null,"",{"$f":"IF(ISNA(VLOOKUP(E1083,Prices!$B$2:$C$465,2,TRUE)),\"\",VLOOKUP(E1083,Prices!$B$2:$C$465,2,TRUE))","v":""},null,null,"",""]
[null,null,null,null,"",{"$f":"IF(ISNA(VLOOKUP(E1084,Prices!$B$2:$C$465,2,TRUE)),\"\",VLOOKUP(E1084,Prices!$B$2:$C$465,2,TRUE))","v":""},null,null,"",""]
[null,null,null,null,"",{"$f":"IF(ISNA(VLOOKUP(E1085,Prices!$B$2:$C$465,2,TRUE)),\"\",VLOOKUP(E1085,Prices!$B$2:$C$465,2,TRUE))","v":""},null,null,"",""]
[null,null,null,null,"",{"$f":"IF(ISNA(VLOOKUP(E1086,Prices!$B$2:$C$465,2,TRUE)),\"\",VLOOKUP(E1086,Prices!$B$2:$C$465,2,TRUE))","v":""},null,null,"",""]
[null,null,null,null,"",{"$f":"IF(ISNA(VLOOKUP(E1087,Prices!$B$2:$C$465,2,TRUE)),\"\",VLOOKUP(E1087,Prices!$B$2:$C$465,2,TRUE))","v":""},null,null,"",""]
[null,null,null,null,"",{"$f":"IF(ISNA(VLOOKUP(E1088,Prices!$B$2:$C$465,2,TRUE)),\"\",VLOOKUP(E1088,Prices!$B$2:$C$465,2,TRUE))","v":""},null,null,"",""]
[null,null,null,null,"",{"$f":"IF(ISNA(VLOOKUP(E1089,Prices!$B$2:$C$465,2,TRUE)),\"\",VLOOKUP(E1089,Prices!$B$2:$C$465,2,TRUE))","v":""},null,null,"",""]
[null,null,null,null,"",{"$f":"IF(ISNA(VLOOKUP(E1090,Prices!$B$2:$C$465,2,TRUE)),\"\",VLOOKUP(E1090,Prices!$B$2:$C$465,2,TRUE))","v":""},null,null,"",""]
[null,null,null,null,"",{"$f":"IF(ISNA(VLOOKUP(E1091,Prices!$B$2:$C$465,2,TRUE)),\"\",VLOOKUP(E1091,Prices!$B$2:$C$465,2,TRUE))","v":""},null,null,"",""]
[null,null,null,null,"",{"$f":"IF(ISNA(VLOOKUP(E1092,Prices!$B$2:$C$465,2,TRUE)),\"\",VLOOKUP(E1092,Prices!$B$2:$C$465,2,TRUE))","v":""},null,null,"",""]
[null,null,null,null,"",{"$f":"IF(ISNA(VLOOKUP(E1093,Prices!$B$2:$C$465,2,TRUE)),\"\",VLOOKUP(E1093,Prices!$B$2:$C$465,2,TRUE))","v":""},null,null,"",""]
[null,null,null,null,"",{"$f":"IF(ISNA(VLOOKUP(E1094,Prices!$B$2:$C$465,2,TRUE)),\"\",VLOOKUP(E1094,Prices!$B$2:$C$465,2,TRUE))","v":""},null,null,"",""]
[null,null,null,null,"",{"$f":"IF(ISNA(VLOOKUP(E1095,Prices!$B$2:$C$465,2,TRUE)),\"\",VLOOKUP(E1095,Prices!$B$2:$C$465,2,TRUE))","v":""},null,null,"",""]
[null,null,null,null,"",{"$f":"IF(ISNA(VLOOKUP(E1096,Prices!$B$2:$C$465,2,TRUE)),\"\",VLOOKUP(E1096,Prices!$B$2:$C$465,2,TRUE))","v":""},null,null,"",""]
[null,null,null,null,{"$f":"IF(LEN(D1097)=0,\"\",C1097&TEXT(D1097,\"0000\"))","v":""},{"$f":"IF(ISNA(VLOOKUP(E1097,Prices!$B$2:$C$465,2,TRUE)),\"\",VLOOKUP(E1097,Prices!$B$2:$C$465,2,TRUE))","v":""},null,null,{"$f":"IF(OR(G1097=\"\",H1097=\"\"),\"\",H1097-G1097+1)","v":""},{"$f":"IF(ISNUMBER(F1097*I1097),F1097*I1097,\"\")","v":""}]
[null,null,null,null,"",{"$f":"IF(ISNA(VLOOKUP(E1098,Prices!$B$2:$C$465,2,TRUE)),\"\",VLOOKUP(E1098,Prices!$B$2:$C$465,2,TRUE))","v":""},null,null,"",""]
[null,null,null,null,"",{"$f":"IF(ISNA(VLOOKUP(E1099,Prices!$B$2:$C$465,2,TRUE)),\"\",VLOOKUP(E1099,Prices!$B$2:$C$465,2,TRUE))","v":""},null,null,"",""]
[null,null,null,null,"",{"$f":"IF(ISNA(VLOOKUP(E1100,Prices!$B$2:$C$465,2,TRUE)),\"\",VLOOKUP(E1100,Prices!$B$2:$C$465,2,TRUE))","v":""},null,null,"",""]
[null,null,null,null,"",{"$f":"IF(ISNA(VLOOKUP(E1101,Prices!$B$2:$C$465,2,TRUE)),\"\",VLOOKUP(E1101,Prices!$B$2:$C$465,2,TRUE))","v":""},null,null,"",""]
[null,null,null,null,"",{"$f":"IF(ISNA(VLOOKUP(E1102,Prices!$B$2:$C$465,2,TRUE)),\"\",VLOOKUP(E1102,Prices!$B$2:$C$465,2,TRUE))","v":""},null,null,"",""]
[null,null,null,null,"",{"$f":"IF(ISNA(VLOOKUP(E1103,Prices!$B$2:$C$465,2,TRUE)),\"\",VLOOKUP(E1103,Prices!$B$2:$C$465,2,TRUE))","v":""},null,null,"",""]
[null,null,null,null,"",{"$f":"IF(ISNA(VLOOKUP(E1104,Prices!$B$2:$C$465,2,TRUE)),\"\",VLOOKUP(E1104,Prices!$B$2:$C$465,2,TRUE))","v":""},null,null,"",""]
[null,null,null,null,"",{"$f":"IF(ISNA(VLOOKUP(E1105,Prices!$B$2:$C$465,2,TRUE)),\"\",VLOOKUP(E1105,Prices!$B$2:$C$465,2,TRUE))","v":""},null,null,"",""]
[null,null,null,null,"",{"$f":"IF(ISNA(VLOOKUP(E1106,Prices!$B$2:$C$465,2,TRUE)),\"\",VLOOKUP(E1106,Prices!$B$2:$C$465,2,TRUE))","v":""},null,null,"",""]
[null,null,null,null,"",{"$f":"IF(ISNA(VLOOKUP(E1107,Prices!$B$2:$C$465,2,TRUE)),\"\",VLOOKUP(E1107,Prices!$B$2:$C$465,2,TRUE))","v":""},null,null,"",""]
[null,null,null,null,"",{"$f":"IF(ISNA(VLOOKUP(E1108,Prices!$B$2:$C$465,2,TRUE)),\"\",VLOOKUP(E1108,Prices!$B$2:$C$465,2,TRUE))","v":""},null,null,"",""]
[null,null,null,null,"",{"$f":"IF(ISNA(VLOOKUP(E1109,Prices!$B$2:$C$465,2,TRUE)),\"\",VLOOKUP(E1109,Prices!$B$2:$C$465,2,TRUE))","v":""},null,null,"",""]
[null,null,null,null,"",{"$f":"IF(ISNA(VLOOKUP(E1110,Prices!$B$2:$C$465,2,TRUE)),\"\",VLOOKUP(E1110,Prices!$B$2:$C$465,2,TRUE))","v":""},null,null,"",""]
[null,null,null,null,"",{"$f":"IF(ISNA(VLOOKUP(E1111,Prices!$B$2:$C$465,2,TRUE)),\"\",VLOOKUP(E1111,Prices!$B$2:$C$465,2,TRUE))","v":""},null,null,"",""]
[null,null,null,null,"",{"$f":"IF(ISNA(VLOOKUP(E1112,Prices!$B$2:$C$465,2,TRUE)),\"\",VLOOKUP(E1112,Prices!$B$2:$C$465,2,TRUE))","v":""},null,null,"",""]
[null,null,null,null,"",{"$f":"IF(ISNA(VLOOKUP(E1113,Prices!$B$2:$C$465,2,TRUE)),\"\",VLOOKUP(E1113,Prices!$B$2:$C$465,2,TRUE))","v":""},null,null,"",""]
[null,null,null,null,"",{"$f":"IF(ISNA(VLOOKUP(E1114,Prices!$B$2:$C$465,2,TRUE)),\"\",VLOOKUP(E1114,Prices!$B$2:$C$465,2,TRUE))","v":""},null,null,"",""]
[null,null,null,null,"",{"$f":"IF(ISNA(VLOOKUP(E1115,Prices!$B$2:$C$465,2,TRUE)),\"\",VLOOKUP(E1115,Prices!$B$2:$C$465,2,TRUE))","v":""},null,null,"",""]
[null,null,null,null,"",{"$f":"IF(ISNA(VLOOKUP(E1116,Prices!$B$2:$C$465,2,TRUE)),\"\",VLOOKUP(E1116,Prices!$B$2:$C$465,2,TRUE))","v":""},null,null,"",""]
[null,null,null,null,"",{"$f":"IF(ISNA(VLOOKUP(E1117,Prices!$B$2:$C$465,2,TRUE)),\"\",VLOOKUP(E1117,Prices!$B$2:$C$465,2,TRUE))","v":""},null,null,"",""]
[null,null,null,null,"",{"$f":"IF(ISNA(VLOOKUP(E1118,Prices!$B$2:$C$465,2,TRUE)),\"\",VLOOKUP(E1118,Prices!$B$2:$C$465,2,TRUE))","v":""},null,null,"",""]
[null,null,null,null,"",{"$f":"IF(ISNA(VLOOKUP(E1119,Prices!$B$2:$C$465,2,TRUE)),\"\",VLOOKUP(E1119,Prices!$B$2:$C$465,2,TRUE))","v":""},null,null,"",""]
[null,null,null,null,"",{"$f":"IF(ISNA(VLOOKUP(E1120,Prices!$B$2:$C$465,2,TRUE)),\"\",VLOOKUP(E1120,Prices!$B$2:$C$465,2,TRUE))","v":""},null,null,"",""]
[null,null,null,null,"",{"$f":"IF(ISNA(VLOOKUP(E1121,Prices!$B$2:$C$465,2,TRUE)),\"\",VLOOKUP(E1121,Prices!$B$2:$C$465,2,TRUE))","v":""},null,null,"",""]
[null,null,null,null,"",{"$f":"IF(ISNA(VLOOKUP(E1122,Prices!$B$2:$C$465,2,TRUE)),\"\",VLOOKUP(E1122,Prices!$B$2:$C$465,2,TRUE))","v":""},null,null,"",""]
[null,null,null,null,"",{"$f":"IF(ISNA(VLOOKUP(E1123,Prices!$B$2:$C$465,2,TRUE)),\"\",VLOOKUP(E1123,Prices!$B$2:$C$465,2,TRUE))","v":""},null,null,"",""]
[null,null,null,null,"",{"$f":"IF(ISNA(VLOOKUP(E1124,Prices!$B$2:$C$465,2,TRUE)),\"\",VLOOKUP(E1124,Prices!$B$2:$C$465,2,TRUE))","v":""},null,null,"",""]
[null,null,null,null,"",{"$f":"IF(ISNA(VLOOKUP(E1125,Prices!$B$2:$C$465,2,TRUE)),\"\",VLOOKUP(E1125,Prices!$B$2:$C$465,2,TRUE))","v":""},null,null,"",""]
[null,null,null,null,"",{"$f":"IF(ISNA(VLOOKUP(E1126,Prices!$B$2:$C$465,2,TRUE)),\"\",VLOOKUP(E1126,Prices!$B$2:$C$465,2,TRUE))","v":""},null,null,"",""]
[null,null,null,null,"",{"$f":"IF(ISNA(VLOOKUP(E1127,Prices!$B$2:$C$465,2,TRUE)),\"\",VLOOKUP(E1127,Prices!$B$2:$C$465,2,TRUE))","v":""},null,null,"",""]
[null,null,null,null,"",{"$f":"IF(ISNA(VLOOKUP(E1128,Prices!$B$2:$C$465,2,TRUE)),\"\",VLOOKUP(E1128,Prices!$B$2:$C$465,2,TRUE))","v":""},null,null,"",""]
[null,null,null,null,"",{"$f":"IF(ISNA(VLOOKUP(E1129,Prices!$B$2:$C$465,2,TRUE)),\"\",VLOOKUP(E1129,Prices!$B$2:$C$465,2,TRUE))","v":""},null,null,"",""]
[null,null,null,null,"",{"$f":"IF(ISNA(VLOOKUP(E1130,Prices!$B$2:$C$465,2,TRUE)),\"\",VLOOKUP(E1130,Prices!$B$2:$C$465,2,TRUE))","v":""},null,null,"",""]
[null,null,null,null,"",{"$f":"IF(ISNA(VLOOKUP(E1131,Prices!$B$2:$C$465,2,TRUE)),\"\",VLOOKUP(E1131,Prices!$B$2:$C$465,2,TRUE))","v":""},null,null,"",""]
[null,null,null,null,"",{"$f":"IF(ISNA(VLOOKUP(E1132,Prices!$B$2:$C$465,2,TRUE)),\"\",VLOOKUP(E1132,Prices!$B$2:$C$465,2,TRUE))","v":""},null,null,"",""]
[null,null,null,null,"",{"$f":"IF(ISNA(VLOOKUP(E1133,Prices!$B$2:$C$465,2,TRUE)),\"\",VLOOKUP(E1133,Prices!$B$2:$C$465,2,TRUE))","v":""},null,null,"",""]
[null,null,null,null,"",{"$f":"IF(ISNA(VLOOKUP(E1134,Prices!$B$2:$C$465,2,TRUE)),\"\",VLOOKUP(E1134,Prices!$B$2:$C$465,2,TRUE))","v":""},null,null,"",""]
[null,null,null,null,"",{"$f":"IF(ISNA(VLOOKUP(E1135,Prices!$B$2:$C$465,2,TRUE)),\"\",VLOOKUP(E1135,Prices!$B$2:$C$465,2,TRUE))","v":""},null,null,"",""]
[null,null,null,null,"",{"$f":"IF(ISNA(VLOOKUP(E1136,Prices!$B$2:$C$465,2,TRUE)),\"\",VLOOKUP(E1136,Prices!$B$2:$C$465,2,TRUE))","v":""},null,null,"",""]
[null,null,null,null,"",{"$f":"IF(ISNA(VLOOKUP(E1137,Prices!$B$2:$C$465,2,TRUE)),\"\",VLOOKUP(E1137,Prices!$B$2:$C$465,2,TRUE))","v":""},null,null,"",""]
[null,null,null,null,"",{"$f":"IF(ISNA(VLOOKUP(E1138,Prices!$B$2:$C$465,2,TRUE)),\"\",VLOOKUP(E1138,Prices!$B$2:$C$465,2,TRUE))","v":""},null,null,"",""]
[null,null,null,null,"",{"$f":"IF(ISNA(VLOOKUP(E1139,Prices!$B$2:$C$465,2,TRUE)),\"\",VLOOKUP(E1139,Prices!$B$2:$C$465,2,TRUE))","v":""},null,null,"",""]
[null,null,null,null,"",{"$f":"IF(ISNA(VLOOKUP(E1140,Prices!$B$2:$C$465,2,TRUE)),\"\",VLOOKUP(E1140,Prices!$B$2:$C$465,2,TRUE))","v":""},null,null,"",""]
[null,null,null,null,"",{"$f":"IF(ISNA(VLOOKUP(E1141,Prices!$B$2:$C$465,2,TRUE)),\"\",VLOOKUP(E1141,Prices!$B$2:$C$465,2,TRUE))","v":""},null,null,"",""]
[null,null,null,null,"",{"$f":"IF(ISNA(VLOOKUP(E1142,Prices!$B$2:$C$465,2,TRUE)),\"\",VLOOKUP(E1142,Prices!$B$2:$C$465,2,TRUE))","v":""},null,null,"",""]
[null,null,null,null,"",{"$f":"IF(ISNA(VLOOKUP(E1143,Prices!$B$2:$C$465,2,TRUE)),\"\",VLOOKUP(E1143,Prices!$B$2:$C$465,2,TRUE))","v":""},null,null,"",""]
[null,null,null,null,"",{"$f":"IF(ISNA(VLOOKUP(E1144,Prices!$B$2:$C$465,2,TRUE)),\"\",VLOOKUP(E1144,Prices!$B$2:$C$465,2,TRUE))","v":""},null,null,"",""]
[null,null,null,null,"",{"$f":"IF(ISNA(VLOOKUP(E1145,Prices!$B$2:$C$465,2,TRUE)),\"\",VLOOKUP(E1145,Prices!$B$2:$C$465,2,TRUE))","v":""},null,null,"",""]
[null,null,null,null,"",{"$f":"IF(ISNA(VLOOKUP(E1146,Prices!$B$2:$C$465,2,TRUE)),\"\",VLOOKUP(E1146,Prices!$B$2:$C$465,2,TRUE))","v":""},null,null,"",""]
[null,null,null,null,"",{"$f":"IF(ISNA(VLOOKUP(E1147,Prices!$B$2:$C$465,2,TRUE)),\"\",VLOOKUP(E1147,Prices!$B$2:$C$465,2,TRUE))","v":""},null,null,"",""]
[null,null,null,null,"",{"$f":"IF(ISNA(VLOOKUP(E1148,Prices!$B$2:$C$465,2,TRUE)),\"\",VLOOKUP(E1148,Prices!$B$2:$C$465,2,TRUE))","v":""},null,null,"",""]
[null,null,null,null,"",{"$f":"IF(ISNA(VLOOKUP(E1149,Prices!$B$2:$C$465,2,TRUE)),\"\",VLOOKUP(E1149,Prices!$B$2:$C$465,2,TRUE))","v":""},null,null,"",""]
[null,null,null,null,"",{"$f":"IF(ISNA(VLOOKUP(E1150,Prices!$B$2:$C$465,2,TRUE)),\"\",VLOOKUP(E1150,Prices!$B$2:$C$465,2,TRUE))","v":""},null,null,"",""]
[null,null,null,null,"",{"$f":"IF(ISNA(VLOOKUP(E1151,Prices!$B$2:$C$465,2,TRUE)),\"\",VLOOKUP(E1151,Prices!$B$2:$C$465,2,TRUE))","v":""},null,null,"",""]
[null,null,null,null,"",{"$f":"IF(ISNA(VLOOKUP(E1152,Prices!$B$2:$C$465,2,TRUE)),\"\",VLOOKUP(E1152,Prices!$B$2:$C$465,2,TRUE))","v":""},null,null,"",""]
[null,null,null,null,"",{"$f":"IF(ISNA(VLOOKUP(E1153,Prices!$B$2:$C$465,2,TRUE)),\"\",VLOOKUP(E1153,Prices!$B$2:$C$465,2,TRUE))","v":""},null,null,"",""]
[null,null,null,null,"",{"$f":"IF(ISNA(VLOOKUP(E1154,Prices!$B$2:$C$465,2,TRUE)),\"\",VLOOKUP(E1154,Prices!$B$2:$C$465,2,TRUE))","v":""},null,null,"",""]
[null,null,null,null,"",{"$f":"IF(ISNA(VLOOKUP(E1155,Prices!$B$2:$C$465,2,TRUE)),\"\",VLOOKUP(E1155,Prices!$B$2:$C$465,2,TRUE))","v":""},null,null,"",""]
[null,null,null,null,"",{"$f":"IF(ISNA(VLOOKUP(E1156,Prices!$B$2:$C$465,2,TRUE)),\"\",VLOOKUP(E1156,Prices!$B$2:$C$465,2,TRUE))","v":""},null,null,"",""]
[null,null,null,null,"",{"$f":"IF(ISNA(VLOOKUP(E1157,Prices!$B$2:$C$465,2,TRUE)),\"\",VLOOKUP(E1157,Prices!$B$2:$C$465,2,TRUE))","v":""},null,null,"",""]
[null,null,null,null,"",{"$f":"IF(ISNA(VLOOKUP(E1158,Prices!$B$2:$C$465,2,TRUE)),\"\",VLOOKUP(E1158,Prices!$B$2:$C$465,2,TRUE))","v":""},null,null,"",""]
[null,null,null,null,"",{"$f":"IF(ISNA(VLOOKUP(E1159,Prices!$B$2:$C$465,2,TRUE)),\"\",VLOOKUP(E1159,Prices!$B$2:$C$465,2,TRUE))","v":""},null,null,"",""]
[null,null,null,null,"",{"$f":"IF(ISNA(VLOOKUP(E1160,Prices!$B$2:$C$465,2,TRUE)),\"\",VLOOKUP(E1160,Prices!$B$2:$C$465,2,TRUE))","v":""},null,null,"",""]
[null,null,null,null,{"$f":"IF(LEN(D1161)=0,\"\",C1161&TEXT(D1161,\"0000\"))","v":""},{"$f":"IF(ISNA(VLOOKUP(E1161,Prices!$B$2:$C$465,2,TRUE)),\"\",VLOOKUP(E1161,Prices!$B$2:$C$465,2,TRUE))","v":""},null,null,{"$f":"IF(OR(G1161=\"\",H1161=\"\"),\"\",H1161-G1161+1)","v":""},{"$f":"IF(ISNUMBER(F1161*I1161),F1161*I1161,\"\")","v":""}]
[null,null,null,null,"",{"$f":"IF(ISNA(VLOOKUP(E1162,Prices!$B$2:$C$465,2,TRUE)),\"\",VLOOKUP(E1162,Prices!$B$2:$C$465,2,TRUE))","v":""},null,null,"",""]
[null,null,null,null,"",{"$f":"IF(ISNA(VLOOKUP(E1163,Prices!$B$2:$C$465,2,TRUE)),\"\",VLOOKUP(E1163,Prices!$B$2:$C$465,2,TRUE))","v":""},null,null,"",""]
[null,null,null,null,"",{"$f":"IF(ISNA(VLOOKUP(E1164,Prices!$B$2:$C$465,2,TRUE)),\"\",VLOOKUP(E1164,Prices!$B$2:$C$465,2,TRUE))","v":""},null,null,"",""]
[null,null,null,null,"",{"$f":"IF(ISNA(VLOOKUP(E1165,Prices!$B$2:$C$465,2,TRUE)),\"\",VLOOKUP(E1165,Prices!$B$2:$C$465,2,TRUE))","v":""},null,null,"",""]
[null,null,null,null,"",{"$f":"IF(ISNA(VLOOKUP(E1166,Prices!$B$2:$C$465,2,TRUE)),\"\",VLOOKUP(E1166,Prices!$B$2:$C$465,2,TRUE))","v":""},null,null,"",""]
[null,null,null,null,"",{"$f":"IF(ISNA(VLOOKUP(E1167,Prices!$B$2:$C$465,2,TRUE)),\"\",VLOOKUP(E1167,Prices!$B$2:$C$465,2,TRUE))","v":""},null,null,"",""]
[null,null,null,null,"",{"$f":"IF(ISNA(VLOOKUP(E1168,Prices!$B$2:$C$465,2,TRUE)),\"\",VLOOKUP(E1168,Prices!$B$2:$C$465,2,TRUE))","v":""},null,null,"",""]
[null,null,null,null,"",{"$f":"IF(ISNA(VLOOKUP(E1169,Prices!$B$2:$C$465,2,TRUE)),\"\",VLOOKUP(E1169,Prices!$B$2:$C$465,2,TRUE))","v":""},null,null,"",""]
[null,null,null,null,"",{"$f":"IF(ISNA(VLOOKUP(E1170,Prices!$B$2:$C$465,2,TRUE)),\"\",VLOOKUP(E1170,Prices!$B$2:$C$465,2,TRUE))","v":""},null,null,"",""]
[null,null,null,null,"",{"$f":"IF(ISNA(VLOOKUP(E1171,Prices!$B$2:$C$465,2,TRUE)),\"\",VLOOKUP(E1171,Prices!$B$2:$C$465,2,TRUE))","v":""},null,null,"",""]
[null,null,null,null,"",{"$f":"IF(ISNA(VLOOKUP(E1172,Prices!$B$2:$C$465,2,TRUE)),\"\",VLOOKUP(E1172,Prices!$B$2:$C$465,2,TRUE))","v":""},null,null,"",""]
[null,null,null,null,"",{"$f":"IF(ISNA(VLOOKUP(E1173,Prices!$B$2:$C$465,2,TRUE)),\"\",VLOOKUP(E1173,Prices!$B$2:$C$465,2,TRUE))","v":""},null,null,"",""]
[null,null,null,null,"",{"$f":"IF(ISNA(VLOOKUP(E1174,Prices!$B$2:$C$465,2,TRUE)),\"\",VLOOKUP(E1174,Prices!$B$2:$C$465,2,TRUE))","v":""},null,null,"",""]
[null,null,null,null,"",{"$f":"IF(ISNA(VLOOKUP(E1175,Prices!$B$2:$C$465,2,TRUE)),\"\",VLOOKUP(E1175,Prices!$B$2:$C$465,2,TRUE))","v":""},null,null,"",""]
[null,null,null,null,"",{"$f":"IF(ISNA(VLOOKUP(E1176,Prices!$B$2:$C$465,2,TRUE)),\"\",VLOOKUP(E1176,Prices!$B$2:$C$465,2,TRUE))","v":""},null,null,"",""]
[null,null,null,null,"",{"$f":"IF(ISNA(VLOOKUP(E1177,Prices!$B$2:$C$465,2,TRUE)),\"\",VLOOKUP(E1177,Prices!$B$2:$C$465,2,TRUE))","v":""},null,null,"",""]
[null,null,null,null,"",{"$f":"IF(ISNA(VLOOKUP(E1178,Prices!$B$2:$C$465,2,TRUE)),\"\",VLOOKUP(E1178,Prices!$B$2:$C$465,2,TRUE))","v":""},null,null,"",""]
[null,null,null,null,"",{"$f":"IF(ISNA(VLOOKUP(E1179,Prices!$B$2:$C$465,2,TRUE)),\"\",VLOOKUP(E1179,Prices!$B$2:$C$465,2,TRUE))","v":""},null,null,"",""]
[null,null,null,null,"",{"$f":"IF(ISNA(VLOOKUP(E1180,Prices!$B$2:$C$465,2,TRUE)),\"\",VLOOKUP(E1180,Prices!$B$2:$C$465,2,TRUE))","v":""},null,null,"",""]
[null,null,null,null,"",{"$f":"IF(ISNA(VLOOKUP(E1181,Prices!$B$2:$C$465,2,TRUE)),\"\",VLOOKUP(E1181,Prices!$B$2:$C$465,2,TRUE))","v":""},null,null,"",""]
[null,null,null,null,"",{"$f":"IF(ISNA(VLOOKUP(E1182,Prices!$B$2:$C$465,2,TRUE)),\"\",VLOOKUP(E1182,Prices!$B$2:$C$465,2,TRUE))","v":""},null,null,"",""]
[null,null,null,null,"",{"$f":"IF(ISNA(VLOOKUP(E1183,Prices!$B$2:$C$465,2,TRUE)),\"\",VLOOKUP(E1183,Prices!$B$2:$C$465,2,TRUE))","v":""},null,null,"",""]
[null,null,null,null,"",{"$f":"IF(ISNA(VLOOKUP(E1184,Prices!$B$2:$C$465,2,TRUE)),\"\",VLOOKUP(E1184,Prices!$B$2:$C$465,2,TRUE))","v":""},null,null,"",""]
[null,null,null,null,"",{"$f":"IF(ISNA(VLOOKUP(E1185,Prices!$B$2:$C$465,2,TRUE)),\"\",VLOOKUP(E1185,Prices!$B$2:$C$465,2,TRUE))","v":""},null,null,"",""]
[null,null,null,null,"",{"$f":"IF(ISNA(VLOOKUP(E1186,Prices!$B$2:$C$465,2,TRUE)),\"\",VLOOKUP(E1186,Prices!$B$2:$C$465,2,TRUE))","v":""},null,null,"",""]
[null,null,null,null,"",{"$f":"IF(ISNA(VLOOKUP(E1187,Prices!$B$2:$C$465,2,TRUE)),\"\",VLOOKUP(E1187,Prices!$B$2:$C$465,2,TRUE))","v":""},null,null,"",""]
[null,null,null,null,"",{"$f":"IF(ISNA(VLOOKUP(E1188,Prices!$B$2:$C$465,2,TRUE)),\"\",VLOOKUP(E1188,Prices!$B$2:$C$465,2,TRUE))","v":""},null,null,"",""]
[null,null,null,null,"",{"$f":"IF(ISNA(VLOOKUP(E1189,Prices!$B$2:$C$465,2,TRUE)),\"\",VLOOKUP(E1189,Prices!$B$2:$C$465,2,TRUE))","v":""},null,null,"",""]
[null,null,null,null,"",{"$f":"IF(ISNA(VLOOKUP(E1190,Prices!$B$2:$C$465,2,TRUE)),\"\",VLOOKUP(E1190,Prices!$B$2:$C$465,2,TRUE))","v":""},null,null,"",""]
[null,null,null,null,"",{"$f":"IF(ISNA(VLOOKUP(E1191,Prices!$B$2:$C$465,2,TRUE)),\"\",VLOOKUP(E1191,Prices!$B$2:$C$465,2,TRUE))","v":""},null,null,"",""]
[null,null,null,null,"",{"$f":"IF(ISNA(VLOOKUP(E1192,Prices!$B$2:$C$465,2,TRUE)),\"\",VLOOKUP(E1192,Prices!$B$2:$C$465,2,TRUE))","v":""},null,null,"",""]
[null,null,null,null,"",{"$f":"IF(ISNA(VLOOKUP(E1193,Prices!$B$2:$C$465,2,TRUE)),\"\",VLOOKUP(E1193,Prices!$B$2:$C$465,2,TRUE))","v":""},null,null,"",""]
[null,null,null,null,"",{"$f":"IF(ISNA(VLOOKUP(E1194,Prices!$B$2:$C$465,2,TRUE)),\"\",VLOOKUP(E1194,Prices!$B$2:$C$465,2,TRUE))","v":""},null,null,"",""]
[null,null,null,null,"",{"$f":"IF(ISNA(VLOOKUP(E1195,Prices!$B$2:$C$465,2,TRUE)),\"\",VLOOKUP(E1195,Prices!$B$2:$C$465,2,TRUE))","v":""},null,null,"",""]
[null,null,null,null,"",{"$f":"IF(ISNA(VLOOKUP(E1196,Prices!$B$2:$C$465,2,TRUE)),\"\",VLOOKUP(E1196,Prices!$B$2:$C$465,2,TRUE))","v":""},null,null,"",""]
[null,null,null,null,"",{"$f":"IF(ISNA(VLOOKUP(E1197,Prices!$B$2:$C$465,2,TRUE)),\"\",VLOOKUP(E1197,Prices!$B$2:$C$465,2,TRUE))","v":""},null,null,"",""]
[null,null,null,null,"",{"$f":"IF(ISNA(VLOOKUP(E1198,Prices!$B$2:$C$465,2,TRUE)),\"\",VLOOKUP(E1198,Prices!$B$2:$C$465,2,TRUE))","v":""},null,null,"",""]
[null,null,null,null,"",{"$f":"IF(ISNA(VLOOKUP(E1199,Prices!$B$2:$C$465,2,TRUE)),\"\",VLOOKUP(E1199,Prices!$B$2:$C$465,2,TRUE))","v":""},null,null,"",""]
[null,null,null,null,"",{"$f":"IF(ISNA(VLOOKUP(E1200,Prices!$B$2:$C$465,2,TRUE)),\"\",VLOOKUP(E1200,Prices!$B$2:$C$465,2,TRUE))","v":""},null,null,"",""]
[null,null,null,null,"",{"$f":"IF(ISNA(VLOOKUP(E1201,Prices!$B$2:$C$465,2,TRUE)),\"\",VLOOKUP(E1201,Prices!$B$2:$C$465,2,TRUE))","v":""},null,null,"",""]
[null,null,null,null,"",{"$f":"IF(ISNA(VLOOKUP(E1202,Prices!$B$2:$C$465,2,TRUE)),\"\",VLOOKUP(E1202,Prices!$B$2:$C$465,2,TRUE))","v":""},null,null,"",""]
[null,null,null,null,"",{"$f":"IF(ISNA(VLOOKUP(E1203,Prices!$B$2:$C$465,2,TRUE)),\"\",VLOOKUP(E1203,Prices!$B$2:$C$465,2,TRUE))","v":""},null,null,"",""]
[null,null,null,null,"",{"$f":"IF(ISNA(VLOOKUP(E1204,Prices!$B$2:$C$465,2,TRUE)),\"\",VLOOKUP(E1204,Prices!$B$2:$C$465,2,TRUE))","v":""},null,null,"",""]
[null,null,null,null,"",{"$f":"IF(ISNA(VLOOKUP(E1205,Prices!$B$2:$C$465,2,TRUE)),\"\",VLOOKUP(E1205,Prices!$B$2:$C$465,2,TRUE))","v":""},null,null,"",""]
[null,null,null,null,"",{"$f":"IF(ISNA(VLOOKUP(E1206,Prices!$B$2:$C$465,2,TRUE)),\"\",VLOOKUP(E1206,Prices!$B$2:$C$465,2,TRUE))","v":""},null,null,"",""]
[null,null,null,null,"",{"$f":"IF(ISNA(VLOOKUP(E1207,Prices!$B$2:$C$465,2,TRUE)),\"\",VLOOKUP(E1207,Prices!$B$2:$C$465,2,TRUE))","v":""},null,null,"",""]
[null,null,null,null,"",{"$f":"IF(ISNA(VLOOKUP(E1208,Prices!$B$2:$C$465,2,TRUE)),\"\",VLOOKUP(E1208,Prices!$B$2:$C$465,2,TRUE))","v":""},null,null,"",""]
[null,null,null,null,"",{"$f":"IF(ISNA(VLOOKUP(E1209,Prices!$B$2:$C$465,2,TRUE)),\"\",VLOOKUP(E1209,Prices!$B$2:$C$465,2,TRUE))","v":""},null,null,"",""]
[null,null,null,null,"",{"$f":"IF(ISNA(VLOOKUP(E1210,Prices!$B$2:$C$465,2,TRUE)),\"\",VLOOKUP(E1210,Prices!$B$2:$C$465,2,TRUE))","v":""},null,null,"",""]
[null,null,null,null,"",{"$f":"IF(ISNA(VLOOKUP(E1211,Prices!$B$2:$C$465,2,TRUE)),\"\",VLOOKUP(E1211,Prices!$B$2:$C$465,2,TRUE))","v":""},null,null,"",""]
[null,null,null,null,"",{"$f":"IF(ISNA(VLOOKUP(E1212,Prices!$B$2:$C$465,2,TRUE)),\"\",VLOOKUP(E1212,Prices!$B$2:$C$465,2,TRUE))","v":""},null,null,"",""]
[null,null,null,null,"",{"$f":"IF(ISNA(VLOOKUP(E1213,Prices!$B$2:$C$465,2,TRUE)),\"\",VLOOKUP(E1213,Prices!$B$2:$C$465,2,TRUE))","v":""},null,null,"",""]
[null,null,null,null,"",{"$f":"IF(ISNA(VLOOKUP(E1214,Prices!$B$2:$C$465,2,TRUE)),\"\",VLOOKUP(E1214,Prices!$B$2:$C$465,2,TRUE))","v":""},null,null,"",""]
[null,null,null,null,"",{"$f":"IF(ISNA(VLOOKUP(E1215,Prices!$B$2:$C$465,2,TRUE)),\"\",VLOOKUP(E1215,Prices!$B$2:$C$465,2,TRUE))","v":""},null,null,"",""]
[null,null,null,null,"",{"$f":"IF(ISNA(VLOOKUP(E1216,Prices!$B$2:$C$465,2,TRUE)),\"\",VLOOKUP(E1216,Prices!$B$2:$C$465,2,TRUE))","v":""},null,null,"",""]
[null,null,null,null,"",{"$f":"IF(ISNA(VLOOKUP(E1217,Prices!$B$2:$C$465,2,TRUE)),\"\",VLOOKUP(E1217,Prices!$B$2:$C$465,2,TRUE))","v":""},null,null,"",""]
[null,null,null,null,"",{"$f":"IF(ISNA(VLOOKUP(E1218,Prices!$B$2:$C$465,2,TRUE)),\"\",VLOOKUP(E1218,Prices!$B$2:$C$465,2,TRUE))","v":""},null,null,"",""]
[null,null,null,null,"",{"$f":"IF(ISNA(VLOOKUP(E1219,Prices!$B$2:$C$465,2,TRUE)),\"\",VLOOKUP(E1219,Prices!$B$2:$C$465,2,TRUE))","v":""},null,null,"",""]
[null,null,null,null,"",{"$f":"IF(ISNA(VLOOKUP(E1220,Prices!$B$2:$C$465,2,TRUE)),\"\",VLOOKUP(E1220,Prices!$B$2:$C$465,2,TRUE))","v":""},null,null,"",""]
[null,null,null,null,"",{"$f":"IF(ISNA(VLOOKUP(E1221,Prices!$B$2:$C$465,2,TRUE)),\"\",VLOOKUP(E1221,Prices!$B$2:$C$465,2,TRUE))","v":""},null,null,"",""]
[null,null,null,null,"",{"$f":"IF(ISNA(VLOOKUP(E1222,Prices!$B$2:$C$465,2,TRUE)),\"\",VLOOKUP(E1222,Prices!$B$2:$C$465,2,TRUE))","v":""},null,null,"",""]
[null,null,null,null,"",{"$f":"IF(ISNA(VLOOKUP(E1223,Prices!$B$2:$C$465,2,TRUE)),\"\",VLOOKUP(E1223,Prices!$B$2:$C$465,2,TRUE))","v":""},null,null,"",""]
[null,null,null,null,"",{"$f":"IF(ISNA(VLOOKUP(E1224,Prices!$B$2:$C$465,2,TRUE)),\"\",VLOOKUP(E1224,Prices!$B$2:$C$465,2,TRUE))","v":""},null,null,"",""]
[null,null,null,null,{"$f":"IF(LEN(D1225)=0,\"\",C1225&TEXT(D1225,\"0000\"))","v":""},{"$f":"IF(ISNA(VLOOKUP(E1225,Prices!$B$2:$C$465,2,TRUE)),\"\",VLOOKUP(E1225,Prices!$B$2:$C$465,2,TRUE))","v":""},null,null,{"$f":"IF(OR(G1225=\"\",H1225=\"\"),\"\",H1225-G1225+1)","v":""},{"$f":"IF(ISNUMBER(F1225*I1225),F1225*I1225,\"\")","v":""}]
[null,null,null,null,"",{"$f":"IF(ISNA(VLOOKUP(E1226,Prices!$B$2:$C$465,2,TRUE)),\"\",VLOOKUP(E1226,Prices!$B$2:$C$465,2,TRUE))","v":""},null,null,"",""]
[null,null,null,null,"",{"$f":"IF(ISNA(VLOOKUP(E1227,Prices!$B$2:$C$465,2,TRUE)),\"\",VLOOKUP(E1227,Prices!$B$2:$C$465,2,TRUE))","v":""},null,null,"",""]
[null,null,null,null,"",{"$f":"IF(ISNA(VLOOKUP(E1228,Prices!$B$2:$C$465,2,TRUE)),\"\",VLOOKUP(E1228,Prices!$B$2:$C$465,2,TRUE))","v":""},null,null,"",""]
[null,null,null,null,"",{"$f":"IF(ISNA(VLOOKUP(E1229,Prices!$B$2:$C$465,2,TRUE)),\"\",VLOOKUP(E1229,Prices!$B$2:$C$465,2,TRUE))","v":""},null,null,"",""]
[null,null,null,null,"",{"$f":"IF(ISNA(VLOOKUP(E1230,Prices!$B$2:$C$465,2,TRUE)),\"\",VLOOKUP(E1230,Prices!$B$2:$C$465,2,TRUE))","v":""},null,null,"",""]
[null,null,null,null,"",{"$f":"IF(ISNA(VLOOKUP(E1231,Prices!$B$2:$C$465,2,TRUE)),\"\",VLOOKUP(E1231,Prices!$B$2:$C$465,2,TRUE))","v":""},null,null,"",""]
[null,null,null,null,"",{"$f":"IF(ISNA(VLOOKUP(E1232,Prices!$B$2:$C$465,2,TRUE)),\"\",VLOOKUP(E1232,Prices!$B$2:$C$465,2,TRUE))","v":""},null,null,"",""]
[null,null,null,null,"",{"$f":"IF(ISNA(VLOOKUP(E1233,Prices!$B$2:$C$465,2,TRUE)),\"\",VLOOKUP(E1233,Prices!$B$2:$C$465,2,TRUE))","v":""},null,null,"",""]
[null,null,null,null,"",{"$f":"IF(ISNA(VLOOKUP(E1234,Prices!$B$2:$C$465,2,TRUE)),\"\",VLOOKUP(E1234,Prices!$B$2:$C$465,2,TRUE))","v":""},null,null,"",""]
[null,null,null,null,"",{"$f":"IF(ISNA(VLOOKUP(E1235,Prices!$B$2:$C$465,2,TRUE)),\"\",VLOOKUP(E1235,Prices!$B$2:$C$465,2,TRUE))","v":""},null,null,"",""]
[null,null,null,null,"",{"$f":"IF(ISNA(VLOOKUP(E1236,Prices!$B$2:$C$465,2,TRUE)),\"\",VLOOKUP(E1236,Prices!$B$2:$C$465,2,TRUE))","v":""},null,null,"",""]
[null,null,null,null,"",{"$f":"IF(ISNA(VLOOKUP(E1237,Prices!$B$2:$C$465,2,TRUE)),\"\",VLOOKUP(E1237,Prices!$B$2:$C$465,2,TRUE))","v":""},null,null,"",""]
[null,null,null,null,"",{"$f":"IF(ISNA(VLOOKUP(E1238,Prices!$B$2:$C$465,2,TRUE)),\"\",VLOOKUP(E1238,Prices!$B$2:$C$465,2,TRUE))","v":""},null,null,"",""]
[null,null,null,null,"",{"$f":"IF(ISNA(VLOOKUP(E1239,Prices!$B$2:$C$465,2,TRUE)),\"\",VLOOKUP(E1239,Prices!$B$2:$C$465,2,TRUE))","v":""},null,null,"",""]
[null,null,null,null,"",{"$f":"IF(ISNA(VLOOKUP(E1240,Prices!$B$2:$C$465,2,TRUE)),\"\",VLOOKUP(E1240,Prices!$B$2:$C$465,2,TRUE))","v":""},null,null,"",""]
[null,null,null,null,"",{"$f":"IF(ISNA(VLOOKUP(E1241,Prices!$B$2:$C$465,2,TRUE)),\"\",VLOOKUP(E1241,Prices!$B$2:$C$465,2,TRUE))","v":""},null,null,"",""]
[null,null,null,null,"",{"$f":"IF(ISNA(VLOOKUP(E1242,Prices!$B$2:$C$465,2,TRUE)),\"\",VLOOKUP(E1242,Prices!$B$2:$C$465,2,TRUE))","v":""},null,null,"",""]
[null,null,null,null,"",{"$f":"IF(ISNA(VLOOKUP(E1243,Prices!$B$2:$C$465,2,TRUE)),\"\",VLOOKUP(E1243,Prices!$B$2:$C$465,2,TRUE))","v":""},null,null,"",""]
[null,null,null,null,"",{"$f":"IF(ISNA(VLOOKUP(E1244,Prices!$B$2:$C$465,2,TRUE)),\"\",VLOOKUP(E1244,Prices!$B$2:$C$465,2,TRUE))","v":""},null,null,"",""]
[null,null,null,null,"",{"$f":"IF(ISNA(VLOOKUP(E1245,Prices!$B$2:$C$465,2,TRUE)),\"\",VLOOKUP(E1245,Prices!$B$2:$C$465,2,TRUE))","v":""},null,null,"",""]
[null,null,null,null,"",{"$f":"IF(ISNA(VLOOKUP(E1246,Prices!$B$2:$C$465,2,TRUE)),\"\",VLOOKUP(E1246,Prices!$B$2:$C$465,2,TRUE))","v":""},null,null,"",""]
[null,null,null,null,"",{"$f":"IF(ISNA(VLOOKUP(E1247,Prices!$B$2:$C$465,2,TRUE)),\"\",VLOOKUP(E1247,Prices!$B$2:$C$465,2,TRUE))","v":""},null,null,"",""]
[null,null,null,null,"",{"$f":"IF(ISNA(VLOOKUP(E1248,Prices!$B$2:$C$465,2,TRUE)),\"\",VLOOKUP(E1248,Prices!$B$2:$C$465,2,TRUE))","v":""},null,null,"",""]
[null,null,null,null,"",{"$f":"IF(ISNA(VLOOKUP(E1249,Prices!$B$2:$C$465,2,TRUE)),\"\",VLOOKUP(E1249,Prices!$B$2:$C$465,2,TRUE))","v":""},null,null,"",""]
[null,null,null,null,"",{"$f":"IF(ISNA(VLOOKUP(E1250,Prices!$B$2:$C$465,2,TRUE)),\"\",VLOOKUP(E1250,Prices!$B$2:$C$465,2,TRUE))","v":""},null,null,"",""]
[null,null,null,null,"",{"$f":"IF(ISNA(VLOOKUP(E1251,Prices!$B$2:$C$465,2,TRUE)),\"\",VLOOKUP(E1251,Prices!$B$2:$C$465,2,TRUE))","v":""},null,null,"",""]
[null,null,null,null,"",{"$f":"IF(ISNA(VLOOKUP(E1252,Prices!$B$2:$C$465,2,TRUE)),\"\",VLOOKUP(E1252,Prices!$B$2:$C$465,2,TRUE))","v":""},null,null,"",""]
[null,null,null,null,"",{"$f":"IF(ISNA(VLOOKUP(E1253,Prices!$B$2:$C$465,2,TRUE)),\"\",VLOOKUP(E1253,Prices!$B$2:$C$465,2,TRUE))","v":""},null,null,"",""]
[null,null,null,null,"",{"$f":"IF(ISNA(VLOOKUP(E1254,Prices!$B$2:$C$465,2,TRUE)),\"\",VLOOKUP(E1254,Prices!$B$2:$C$465,2,TRUE))","v":""},null,null,"",""]
[null,null,null,null,"",{"$f":"IF(ISNA(VLOOKUP(E1255,Prices!$B$2:$C$465,2,TRUE)),\"\",VLOOKUP(E1255,Prices!$B$2:$C$465,2,TRUE))","v":""},null,null,"",""]
[null,null,null,null,"",{"$f":"IF(ISNA(VLOOKUP(E1256,Prices!$B$2:$C$465,2,TRUE)),\"\",VLOOKUP(E1256,Prices!$B$2:$C$465,2,TRUE))","v":""},null,null,"",""]
[null,null,null,null,"",{"$f":"IF(ISNA(VLOOKUP(E1257,Prices!$B$2:$C$465,2,TRUE)),\"\",VLOOKUP(E1257,Prices!$B$2:$C$465,2,TRUE))","v":""},null,null,"",""]
[null,null,null,null,"",{"$f":"IF(ISNA(VLOOKUP(E1258,Prices!$B$2:$C$465,2,TRUE)),\"\",VLOOKUP(E1258,Prices!$B$2:$C$465,2,TRUE))","v":""},null,null,"",""]
[null,null,null,null,"",{"$f":"IF(ISNA(VLOOKUP(E1259,Prices!$B$2:$C$465,2,TRUE)),\"\",VLOOKUP(E1259,Prices!$B$2:$C$465,2,TRUE))","v":""},null,null,"",""]
[null,null,null,null,"",{"$f":"IF(ISNA(VLOOKUP(E1260,Prices!$B$2:$C$465,2,TRUE)),\"\",VLOOKUP(E1260,Prices!$B$2:$C$465,2,TRUE))","v":""},null,null,"",""]
[null,null,null,null,"",{"$f":"IF(ISNA(VLOOKUP(E1261,Prices!$B$2:$C$465,2,TRUE)),\"\",VLOOKUP(E1261,Prices!$B$2:$C$465,2,TRUE))","v":""},null,null,"",""]
[null,null,null,null,"",{"$f":"IF(ISNA(VLOOKUP(E1262,Prices!$B$2:$C$465,2,TRUE)),\"\",VLOOKUP(E1262,Prices!$B$2:$C$465,2,TRUE))","v":""},null,null,"",""]
[null,null,null,null,"",{"$f":"IF(ISNA(VLOOKUP(E1263,Prices!$B$2:$C$465,2,TRUE)),\"\",VLOOKUP(E1263,Prices!$B$2:$C$465,2,TRUE))","v":""},null,null,"",""]
[null,null,null,null,"",{"$f":"IF(ISNA(VLOOKUP(E1264,Prices!$B$2:$C$465,2,TRUE)),\"\",VLOOKUP(E1264,Prices!$B$2:$C$465,2,TRUE))","v":""},null,null,"",""]
[null,null,null,null,"",{"$f":"IF(ISNA(VLOOKUP(E1265,Prices!$B$2:$C$465,2,TRUE)),\"\",VLOOKUP(E1265,Prices!$B$2:$C$465,2,TRUE))","v":""},null,null,"",""]
[null,null,null,null,"",{"$f":"IF(ISNA(VLOOKUP(E1266,Prices!$B$2:$C$465,2,TRUE)),\"\",VLOOKUP(E1266,Prices!$B$2:$C$465,2,TRUE))","v":""},null,null,"",""]
[null,null,null,null,"",{"$f":"IF(ISNA(VLOOKUP(E1267,Prices!$B$2:$C$465,2,TRUE)),\"\",VLOOKUP(E1267,Prices!$B$2:$C$465,2,TRUE))","v":""},null,null,"",""]
[null,null,null,null,"",{"$f":"IF(ISNA(VLOOKUP(E1268,Prices!$B$2:$C$465,2,TRUE)),\"\",VLOOKUP(E1268,Prices!$B$2:$C$465,2,TRUE))","v":""},null,null,"",""]
[null,null,null,null,"",{"$f":"IF(ISNA(VLOOKUP(E1269,Prices!$B$2:$C$465,2,TRUE)),\"\",VLOOKUP(E1269,Prices!$B$2:$C$465,2,TRUE))","v":""},null,null,"",""]
[null,null,null,null,"",{"$f":"IF(ISNA(VLOOKUP(E1270,Prices!$B$2:$C$465,2,TRUE)),\"\",VLOOKUP(E1270,Prices!$B$2:$C$465,2,TRUE))","v":""},null,null,"",""]
[null,null,null,null,"",{"$f":"IF(ISNA(VLOOKUP(E1271,Prices!$B$2:$C$465,2,TRUE)),\"\",VLOOKUP(E1271,Prices!$B$2:$C$465,2,TRUE))","v":""},null,null,"",""]
[null,null,null,null,"",{"$f":"IF(ISNA(VLOOKUP(E1272,Prices!$B$2:$C$465,2,TRUE)),\"\",VLOOKUP(E1272,Prices!$B$2:$C$465,2,TRUE))","v":""},null,null,"",""]
[null,null,null,null,"",{"$f":"IF(ISNA(VLOOKUP(E1273,Prices!$B$2:$C$465,2,TRUE)),\"\",VLOOKUP(E1273,Prices!$B$2:$C$465,2,TRUE))","v":""},null,null,"",""]
[null,null,null,null,"",{"$f":"IF(ISNA(VLOOKUP(E1274,Prices!$B$2:$C$465,2,TRUE)),\"\",VLOOKUP(E1274,Prices!$B$2:$C$465,2,TRUE))","v":""},null,null,"",""]
[null,null,null,null,"",{"$f":"IF(ISNA(VLOOKUP(E1275,Prices!$B$2:$C$465,2,TRUE)),\"\",VLOOKUP(E1275,Prices!$B$2:$C$465,2,TRUE))","v":""},null,null,"",""]
[null,null,null,null,"",{"$f":"IF(ISNA(VLOOKUP(E1276,Prices!$B$2:$C$465,2,TRUE)),\"\",VLOOKUP(E1276,Prices!$B$2:$C$465,2,TRUE))","v":""},null,null,"",""]
[null,null,null,null,"",{"$f":"IF(ISNA(VLOOKUP(E1277,Prices!$B$2:$C$465,2,TRUE)),\"\",VLOOKUP(E1277,Prices!$B$2:$C$465,2,TRUE))","v":""},null,null,"",""]
[null,null,null,null,"",{"$f":"IF(ISNA(VLOOKUP(E1278,Prices!$B$2:$C$465,2,TRUE)),\"\",VLOOKUP(E1278,Prices!$B$2:$C$465,2,TRUE))","v":""},null,null,"",""]
[null,null,null,null,"",{"$f":"IF(ISNA(VLOOKUP(E1279,Prices!$B$2:$C$465,2,TRUE)),\"\",VLOOKUP(E1279,Prices!$B$2:$C$465,2,TRUE))","v":""},null,null,"",""]
[null,null,null,null,"",{"$f":"IF(ISNA(VLOOKUP(E1280,Prices!$B$2:$C$465,2,TRUE)),\"\",VLOOKUP(E1280,Prices!$B$2:$C$465,2,TRUE))","v":""},null,null,"",""]
[null,null,null,null,"",{"$f":"IF(ISNA(VLOOKUP(E1281,Prices!$B$2:$C$465,2,TRUE)),\"\",VLOOKUP(E1281,Prices!$B$2:$C$465,2,TRUE))","v":""},null,null,"",""]
[null,null,null,null,"",{"$f":"IF(ISNA(VLOOKUP(E1282,Prices!$B$2:$C$465,2,TRUE)),\"\",VLOOKUP(E1282,Prices!$B$2:$C$465,2,TRUE))","v":""},null,null,"",""]
[null,null,null,null,"",{"$f":"IF(ISNA(VLOOKUP(E1283,Prices!$B$2:$C$465,2,TRUE)),\"\",VLOOKUP(E1283,Prices!$B$2:$C$465,2,TRUE))","v":""},null,null,"",""]
[null,null,null,null,"",{"$f":"IF(ISNA(VLOOKUP(E1284,Prices!$B$2:$C$465,2,TRUE)),\"\",VLOOKUP(E1284,Prices!$B$2:$C$465,2,TRUE))","v":""},null,null,"",""]
[null,null,null,null,"",{"$f":"IF(ISNA(VLOOKUP(E1285,Prices!$B$2:$C$465,2,TRUE)),\"\",VLOOKUP(E1285,Prices!$B$2:$C$465,2,TRUE))","v":""},null,null,"",""]
[null,null,null,null,"",{"$f":"IF(ISNA(VLOOKUP(E1286,Prices!$B$2:$C$465,2,TRUE)),\"\",VLOOKUP(E1286,Prices!$B$2:$C$465,2,TRUE))","v":""},null,null,"",""]
[null,null,null,null,"",{"$f":"IF(ISNA(VLOOKUP(E1287,Prices!$B$2:$C$465,2,TRUE)),\"\",VLOOKUP(E1287,Prices!$B$2:$C$465,2,TRUE))","v":""},null,null,"",""]
[null,null,null,null,"",{"$f":"IF(ISNA(VLOOKUP(E1288,Prices!$B$2:$C$465,2,TRUE)),\"\",VLOOKUP(E1288,Prices!$B$2:$C$465,2,TRUE))","v":""},null,null,"",""]
[null,null,null,null,{"$f":"IF(LEN(D1289)=0,\"\",C1289&TEXT(D1289,\"0000\"))","v":""},{"$f":"IF(ISNA(VLOOKUP(E1289,Prices!$B$2:$C$465,2,TRUE)),\"\",VLOOKUP(E1289,Prices!$B$2:$C$465,2,TRUE))","v":""},null,null,{"$f":"IF(OR(G1289=\"\",H1289=\"\"),\"\",H1289-G1289+1)","v":""},{"$f":"IF(ISNUMBER(F1289*I1289),F1289*I1289,\"\")","v":""}]
[null,null,null,null,"",{"$f":"IF(ISNA(VLOOKUP(E1290,Prices!$B$2:$C$465,2,TRUE)),\"\",VLOOKUP(E1290,Prices!$B$2:$C$465,2,TRUE))","v":""},null,null,"",""]
[null,null,null,null,"",{"$f":"IF(ISNA(VLOOKUP(E1291,Prices!$B$2:$C$465,2,TRUE)),\"\",VLOOKUP(E1291,Prices!$B$2:$C$465,2,TRUE))","v":""},null,null,"",""]
[null,null,null,null,"",{"$f":"IF(ISNA(VLOOKUP(E1292,Prices!$B$2:$C$465,2,TRUE)),\"\",VLOOKUP(E1292,Prices!$B$2:$C$465,2,TRUE))","v":""},null,null,"",""]
[null,null,null,null,"",{"$f":"IF(ISNA(VLOOKUP(E1293,Prices!$B$2:$C$465,2,TRUE)),\"\",VLOOKUP(E1293,Prices!$B$2:$C$465,2,TRUE))","v":""},null,null,"",""]

{"sheet":"rules","index":4,"n_rows":14,"n_cols":1,"rows_kept":14,"cut":false,"hidden":true,"merged":[]}
["Ik weet dat Bente eerder iets anders doorgaf, maar mijn twee collega’s gaven onderstaande feedback (geldt enkel voor hond & paard/pony/ezel):"]
[]
["Identificeren > automatisch ook registreren en paspoort, kan niet alleen"]
[]
["Registreren > kan ook alleen"]
["Een hond kan gechipt zijn en een paspoort hebben maar nog niet geregistreerd zijn."]
[]
["Paspoort > kan ook alleen"]
["Een hond kan gechipt en geregistreerd zijn. Het paspoort is niet meegekomen."]
[]
["               Hopelijk begrijp je wat er bedoeld wordt? Anders kunnen we hiervoor morgen eens bellen om te verduidelijken."]
[]
["1. Pony ontbreekt bij ‘dierenarts’. Kan je hier nog pony toevoegen? Indien dit de layout zou doen verschuiven, mag dit zo gelaten worden."]
["(Pony’s zijn tenslotte ook paarden)"]

{"sheet":"Dierenarts","index":5,"n_rows":1048,"n_cols":32,"rows_kept":1048,"cut":false,"hidden":false,"merged":[]}
[null,"Datum IBN",{"$f":"Startpagina!C13","v":"00:00:00"},null,null,null,null,null,null,null,null,null,null,null,{"$f":"Startpagina!H13","v":1},"TOTAAL"]
[null,"Diergeneeskundig verslag",null,null,null,null,null,null,null,null,null,null,null,null,null,{"$f":"IF(O1=1,0,SUM(E4:E7))","v":0}]
[null,"Dierenarts","Datum","Aantal dieren","EUR",null,null,null,{"$f":"IF(O1=1,Startpagina!F13,\"\")","v":"Tab Dierenarts pas invullen vanaf datum IBN 01/06/2023"}]
[null,null,null,null,{"$f":"IF(D4>0,30+ROUNDUP(D4/10,0)*5,0)","v":0}]
[null,null,null,null,0]
[null,null,null,null,0]
[null,null,null,null,{"$f":"IF(D7>0,30+ROUNDUP(D7/10,0)*5,0)","v":0}]
[null,null,null,null,null,null,null,null,null,null,null,null,null,null,null,"TOTAAL"]
[null,"Dierenartskosten",null,{"$f":"IF(S42>0,\"Gelieve de fouten te verbeteren.  Zie rode vakjes\",\"\")","v":""},null,null,null,null,null,null,null,null,null,null,null,{"$f":"IF(O1=1,0,SUM(P11:P40))","v":0},null,null,null,null,null,null,"paspoort niet meer te valideren"]
[null,"Naam/\nomschrijving","Diersoort","Identificatie-nummer","Geslacht (enkel bij Kat)","Identificeren","EUR","Registreren","EUR","Paspoort","EUR","Vaccinatie","EUR","Sterilisatie/\ncastratie","EUR","Totaal",null,null,null,"Idnr",null,null,"paspoort",null,"staat nu op 0","factor paspoort",null,"identificeren hond 1","paard 4","kat 2","totaal","factor"]
[{"$f":"IF(C11=\"\",0,VLOOKUP(C11,Lijsten!$P$3:$R$6,3,FALSE))","v":0},null,null,null,null,null,{"$f":"IF(F11<>\"ja\",0,IF(C11=\"\",0,AF11*VLOOKUP(C11,Lijsten!$P$3:$Q$6,2,FALSE)))","v":0},null,{"$f":"IF(H11<>\"ja\",0,IF(C11=\"\",0,VLOOKUP(C11,Lijsten!$P$9:$Q$13,2,FALSE)))","v":0},null,{"$f":"IF($C11=\"\",0,IF(J11<>\"ja\",0,Z11*VLOOKUP($C11,Lijsten!$P$16:$Q$19,2,FALSE)))","v":0},null,{"$f":"IF($C11=\"\",0,IF(L11<>\"ja\",0,VLOOKUP($C11,Lijsten!$P$23:$Q$26,2,FALSE)))","v":0},null,{"$f":"IF($E11=\"\",0,IF(N11<>\"ja\",0,VLOOKUP($E11,Lijsten!$P$30:$Q$31,2,FALSE)))","v":0},{"$f":"G11+I11+K11+M11+O11","v":0},{"$f":"AND(C11<>\"Kat\",E11<>\"\")","v":false},{"$f":"AND(C11=\"Kat\",E11=\"\")","v":false},{"$f":"IF(Q11=TRUE,1)+IF(R11=TRUE,1)","v":0},{"$f":"IF(AND(C11<> \"Kleine Herkauwer\",C11<>\"\",D11=\"\"),1,0)","v":0},{"$f":"IF(AND(B11&D11&E11&F11&H11&J11&L11&N11<>\"\",C11=\"\"),1,0)","v":0},null,{"$f":"IF(AND(C11=\"Hond\",J11=\"ja\",OR(F11<>\"ja\",H11<>\"ja\")),1,0)","v":0},{"$f":"IF(AND(C11=\"Paard/Pony/Ezel\",J11=\"ja\",OR(F11<>\"ja\",H11<>\"ja\")),1,0)","v":0},0,{"$f":"IF(Y11=0,1,0)","v":1},null,{"$f":"IF(OR(AND(A11=1,F11=\"ja\",H11<>\"ja\"),AND(A11=1,F11=\"ja\",J11<>\"ja\")),1,0)","v":0},{"$f":"IF(OR(AND(A11=4,F11=\"ja\",H11<>\"ja\"),AND(A11=4,F11=\"ja\",J11<>\"ja\")),1,0)","v":0},{"$f":"IF(AND(A11=2,F11=\"ja\",H11<>\"ja\"),1,0)","v":0},{"$f":"AB11+AC11+AD11","v":0},{"$f":"IF(AE11=0,1,0)","v":1}]
[{"$f":"IF(C12=\"\",0,VLOOKUP(C12,Lijsten!$P$3:$R$6,3,FALSE))","v":0},null,null,null,null,null,{"$f":"IF(F12<>\"ja\",0,IF(C12=\"\",0,AF12*VLOOKUP(C12,Lijsten!$P$3:$Q$6,2,FALSE)))","v":0},null,{"$f":"IF(H12<>\"ja\",0,IF(C12=\"\",0,VLOOKUP(C12,Lijsten!$P$9:$Q$13,2,FALSE)))","v":0},null,{"$f":"IF($C12=\"\",0,IF(J12<>\"ja\",0,Z12*VLOOKUP($C12,Lijsten!$P$16:$Q$19,2,FALSE)))","v":0},null,{"$f":"IF($C12=\"\",0,IF(L12<>\"ja\",0,VLOOKUP($C12,Lijsten!$P$23:$Q$26,2,FALSE)))","v":0},null,{"$f":"IF($E12=\"\",0,IF(N12<>\"ja\",0,VLOOKUP($E12,Lijsten!$P$30:$Q$31,2,FALSE)))","v":0},{"$f":"G12+I12+K12+M12+O12","v":0},{"$f":"AND(C12<>\"Kat\",E12<>\"\")","v":false},{"$f":"AND(C12=\"Kat\",E12=\"\")","v":false},{"$f":"IF(Q12=TRUE,1)+IF(R12=TRUE,1)","v":0},{"$f":"IF(AND(C12<> \"Kleine Herkauwer\",C12<>\"\",D12=\"\"),1,0)","v":0},{"$f":"IF(AND(B12&D12&E12&F12&H12&J12&L12&N12<>\"\",C12=\"\"),1,0)","v":0},null,{"$f":"IF(AND(C12=\"Hond\",J12=\"ja\",OR(F12<>\"ja\",H12<>\"ja\")),1,0)","v":0},{"$f":"IF(AND(C12=\"Paard/Pony/Ezel\",J12=\"ja\",OR(F12<>\"ja\",H12<>\"ja\")),1,0)","v":0},0,{"$f":"IF(Y12=0,1,0)","v":1},null,{"$f":"IF(OR(AND(A12=1,F12=\"ja\",H12<>\"ja\"),AND(A12=1,F12=\"ja\",J12<>\"ja\")),1,0)","v":0},{"$f":"IF(OR(AND(A12=4,F12=\"ja\",H12<>\"ja\"),AND(A12=4,F12=\"ja\",J12<>\"ja\")),1,0)","v":0},{"$f":"IF(AND(A12=2,F12=\"ja\",H12<>\"ja\"),1,0)","v":0},{"$f":"AB12+AC12+AD12","v":0},{"$f":"IF(AE12=0,1,0)","v":1}]
[{"$f":"IF(C13=\"\",0,VLOOKUP(C13,Lijsten!$P$3:$R$6,3,FALSE))","v":0},null,null,null,null,null,{"$f":"IF(F13<>\"ja\",0,IF(C13=\"\",0,AF13*VLOOKUP(C13,Lijsten!$P$3:$Q$6,2,FALSE)))","v":0},null,{"$f":"IF(H13<>\"ja\",0,IF(C13=\"\",0,VLOOKUP(C13,Lijsten!$P$9:$Q$13,2,FALSE)))","v":0},null,{"$f":"IF($C13=\"\",0,IF(J13<>\"ja\",0,Z13*VLOOKUP($C13,Lijsten!$P$16:$Q$19,2,FALSE)))","v":0},null,{"$f":"IF($C13=\"\",0,IF(L13<>\"ja\",0,VLOOKUP($C13,Lijsten!$P$23:$Q$26,2,FALSE)))","v":0},null,{"$f":"IF($E13=\"\",0,IF(N13<>\"ja\",0,VLOOKUP($E13,Lijsten!$P$30:$Q$31,2,FALSE)))","v":0},{"$f":"G13+I13+K13+M13+O13","v":0},{"$f":"AND(C13<>\"Kat\",E13<>\"\")","v":false},{"$f":"AND(C13=\"Kat\",E13=\"\")","v":false},{"$f":"IF(Q13=TRUE,1)+IF(R13=TRUE,1)","v":0},{"$f":"IF(AND(C13<> \"Kleine Herkauwer\",C13<>\"\",D13=\"\"),1,0)","v":0},{"$f":"IF(AND(B13&D13&E13&F13&H13&J13&L13&N13<>\"\",C13=\"\"),1,0)","v":0},null,{"$f":"IF(AND(C13=\"Hond\",J13=\"ja\",OR(F13<>\"ja\",H13<>\"ja\")),1,0)","v":0},{"$f":"IF(AND(C13=\"Paard/Pony/Ezel\",J13=\"ja\",OR(F13<>\"ja\",H13<>\"ja\")),1,0)","v":0},0,{"$f":"IF(Y13=0,1,0)","v":1},null,{"$f":"IF(OR(AND(A13=1,F13=\"ja\",H13<>\"ja\"),AND(A13=1,F13=\"ja\",J13<>\"ja\")),1,0)","v":0},{"$f":"IF(OR(AND(A13=4,F13=\"ja\",H13<>\"ja\"),AND(A13=4,F13=\"ja\",J13<>\"ja\")),1,0)","v":0},{"$f":"IF(AND(A13=2,F13=\"ja\",H13<>\"ja\"),1,0)","v":0},{"$f":"AB13+AC13+AD13","v":0},{"$f":"IF(AE13=0,1,0)","v":1}]
[{"$f":"IF(C14=\"\",0,VLOOKUP(C14,Lijsten!$P$3:$R$6,3,FALSE))","v":0},null,null,null,null,null,{"$f":"IF(F14<>\"ja\",0,IF(C14=\"\",0,AF14*VLOOKUP(C14,Lijsten!$P$3:$Q$6,2,FALSE)))","v":0},null,{"$f":"IF(H14<>\"ja\",0,IF(C14=\"\",0,VLOOKUP(C14,Lijsten!$P$9:$Q$13,2,FALSE)))","v":0},null,{"$f":"IF($C14=\"\",0,IF(J14<>\"ja\",0,Z14*VLOOKUP($C14,Lijsten!$P$16:$Q$19,2,FALSE)))","v":0},null,{"$f":"IF($C14=\"\",0,IF(L14<>\"ja\",0,VLOOKUP($C14,Lijsten!$P$23:$Q$26,2,FALSE)))","v":0},null,{"$f":"IF($E14=\"\",0,IF(N14<>\"ja\",0,VLOOKUP($E14,Lijsten!$P$30:$Q$31,2,FALSE)))","v":0},0,false,false,0,0,0,null,0,0,0,1,null,0,0,0,0,1]
[{"$f":"IF(C15=\"\",0,VLOOKUP(C15,Lijsten!$P$3:$R$6,3,FALSE))","v":0},null,null,null,null,null,{"$f":"IF(F15<>\"ja\",0,IF(C15=\"\",0,AF15*VLOOKUP(C15,Lijsten!$P$3:$Q$6,2,FALSE)))","v":0},null,{"$f":"IF(H15<>\"ja\",0,IF(C15=\"\",0,VLOOKUP(C15,Lijsten!$P$9:$Q$13,2,FALSE)))","v":0},null,{"$f":"IF($C15=\"\",0,IF(J15<>\"ja\",0,Z15*VLOOKUP($C15,Lijsten!$P$16:$Q$19,2,FALSE)))","v":0},null,{"$f":"IF($C15=\"\",0,IF(L15<>\"ja\",0,VLOOKUP($C15,Lijsten!$P$23:$Q$26,2,FALSE)))","v":0},null,{"$f":"IF($E15=\"\",0,IF(N15<>\"ja\",0,VLOOKUP($E15,Lijsten!$P$30:$Q$31,2,FALSE)))","v":0},0,false,false,0,0,0,null,0,0,0,1,null,0,0,0,0,1]
[{"$f":"IF(C16=\"\",0,VLOOKUP(C16,Lijsten!$P$3:$R$6,3,FALSE))","v":0},null,null,null,null,null,{"$f":"IF(F16<>\"ja\",0,IF(C16=\"\",0,AF16*VLOOKUP(C16,Lijsten!$P$3:$Q$6,2,FALSE)))","v":0},null,{"$f":"IF(H16<>\"ja\",0,IF(C16=\"\",0,VLOOKUP(C16,Lijsten!$P$9:$Q$13,2,FALSE)))","v":0},null,{"$f":"IF($C16=\"\",0,IF(J16<>\"ja\",0,Z16*VLOOKUP($C16,Lijsten!$P$16:$Q$19,2,FALSE)))","v":0},null,{"$f":"IF($C16=\"\",0,IF(L16<>\"ja\",0,VLOOKUP($C16,Lijsten!$P$23:$Q$26,2,FALSE)))","v":0},null,{"$f":"IF($E16=\"\",0,IF(N16<>\"ja\",0,VLOOKUP($E16,Lijsten!$P$30:$Q$31,2,FALSE)))","v":0},0,false,false,0,0,0,null,0,0,0,1,null,0,0,0,0,1]
[{"$f":"IF(C17=\"\",0,VLOOKUP(C17,Lijsten!$P$3:$R$6,3,FALSE))","v":0},null,null,null,null,null,{"$f":"IF(F17<>\"ja\",0,IF(C17=\"\",0,AF17*VLOOKUP(C17,Lijsten!$P$3:$Q$6,2,FALSE)))","v":0},null,{"$f":"IF(H17<>\"ja\",0,IF(C17=\"\",0,VLOOKUP(C17,Lijsten!$P$9:$Q$13,2,FALSE)))","v":0},null,{"$f":"IF($C17=\"\",0,IF(J17<>\"ja\",0,Z17*VLOOKUP($C17,Lijsten!$P$16:$Q$19,2,FALSE)))","v":0},null,{"$f":"IF($C17=\"\",0,IF(L17<>\"ja\",0,VLOOKUP($C17,Lijsten!$P$23:$Q$26,2,FALSE)))","v":0},null,{"$f":"IF($E17=\"\",0,IF(N17<>\"ja\",0,VLOOKUP($E17,Lijsten!$P$30:$Q$31,2,FALSE)))","v":0},0,false,{"$f":"AND(C17=\"Kat\",E17=\"\")","v":false},0,0,0,null,0,0,0,1,null,{"$f":"IF(OR(AND(A17=1,F17=\"ja\",H17<>\"ja\"),AND(A17=1,F17=\"ja\",J17<>\"ja\")),1,0)","v":0},0,0,0,1]
[{"$f":"IF(C18=\"\",0,VLOOKUP(C18,Lijsten!$P$3:$R$6,3,FALSE))","v":0},null,null,null,null,null,{"$f":"IF(F18<>\"ja\",0,IF(C18=\"\",0,AF18*VLOOKUP(C18,Lijsten!$P$3:$Q$6,2,FALSE)))","v":0},null,{"$f":"IF(H18<>\"ja\",0,IF(C18=\"\",0,VLOOKUP(C18,Lijsten!$P$9:$Q$13,2,FALSE)))","v":0},null,{"$f":"IF($C18=\"\",0,IF(J18<>\"ja\",0,Z18*VLOOKUP($C18,Lijsten!$P$16:$Q$19,2,FALSE)))","v":0},null,{"$f":"IF($C18=\"\",0,IF(L18<>\"ja\",0,VLOOKUP($C18,Lijsten!$P$23:$Q$26,2,FALSE)))","v":0},null,{"$f":"IF($E18=\"\",0,IF(N18<>\"ja\",0,VLOOKUP($E18,Lijsten!$P$30:$Q$31,2,FALSE)))","v":0},0,false,false,0,0,0,null,0,0,0,1,null,0,0,0,0,1]
[{"$f":"IF(C19=\"\",0,VLOOKUP(C19,Lijsten!$P$3:$R$6,3,FALSE))","v":0},null,null,null,null,null,{"$f":"IF(F19<>\"ja\",0,IF(C19=\"\",0,AF19*VLOOKUP(C19,Lijsten!$P$3:$Q$6,2,FALSE)))","v":0},null,{"$f":"IF(H19<>\"ja\",0,IF(C19=\"\",0,VLOOKUP(C19,Lijsten!$P$9:$Q$13,2,FALSE)))","v":0},null,{"$f":"IF($C19=\"\",0,IF(J19<>\"ja\",0,Z19*VLOOKUP($C19,Lijsten!$P$16:$Q$19,2,FALSE)))","v":0},null,{"$f":"IF($C19=\"\",0,IF(L19<>\"ja\",0,VLOOKUP($C19,Lijsten!$P$23:$Q$26,2,FALSE)))","v":0},null,{"$f":"IF($E19=\"\",0,IF(N19<>\"ja\",0,VLOOKUP($E19,Lijsten!$P$30:$Q$31,2,FALSE)))","v":0},0,false,false,0,0,0,null,0,0,0,1,null,0,0,0,0,1]
[{"$f":"IF(C20=\"\",0,VLOOKUP(C20,Lijsten!$P$3:$R$6,3,FALSE))","v":0},null,null,null,null,null,{"$f":"IF(F20<>\"ja\",0,IF(C20=\"\",0,AF20*VLOOKUP(C20,Lijsten!$P$3:$Q$6,2,FALSE)))","v":0},null,{"$f":"IF(H20<>\"ja\",0,IF(C20=\"\",0,VLOOKUP(C20,Lijsten!$P$9:$Q$13,2,FALSE)))","v":0},null,{"$f":"IF($C20=\"\",0,IF(J20<>\"ja\",0,Z20*VLOOKUP($C20,Lijsten!$P$16:$Q$19,2,FALSE)))","v":0},null,{"$f":"IF($C20=\"\",0,IF(L20<>\"ja\",0,VLOOKUP($C20,Lijsten!$P$23:$Q$26,2,FALSE)))","v":0},null,{"$f":"IF($E20=\"\",0,IF(N20<>\"ja\",0,VLOOKUP($E20,Lijsten!$P$30:$Q$31,2,FALSE)))","v":0},0,false,false,0,0,0,null,0,0,0,1,null,0,0,0,0,1]
[{"$f":"IF(C21=\"\",0,VLOOKUP(C21,Lijsten!$P$3:$R$6,3,FALSE))","v":0},null,null,null,null,null,{"$f":"IF(F21<>\"ja\",0,IF(C21=\"\",0,AF21*VLOOKUP(C21,Lijsten!$P$3:$Q$6,2,FALSE)))","v":0},null,{"$f":"IF(H21<>\"ja\",0,IF(C21=\"\",0,VLOOKUP(C21,Lijsten!$P$9:$Q$13,2,FALSE)))","v":0},null,{"$f":"IF($C21=\"\",0,IF(J21<>\"ja\",0,Z21*VLOOKUP($C21,Lijsten!$P$16:$Q$19,2,FALSE)))","v":0},null,{"$f":"IF($C21=\"\",0,IF(L21<>\"ja\",0,VLOOKUP($C21,Lijsten!$P$23:$Q$26,2,FALSE)))","v":0},null,{"$f":"IF($E21=\"\",0,IF(N21<>\"ja\",0,VLOOKUP($E21,Lijsten!$P$30:$Q$31,2,FALSE)))","v":0},0,false,{"$f":"AND(C21=\"Kat\",E21=\"\")","v":false},0,0,0,null,0,0,0,1,null,0,0,0,0,1]
[{"$f":"IF(C22=\"\",0,VLOOKUP(C22,Lijsten!$P$3:$R$6,3,FALSE))","v":0},null,null,null,null,null,{"$f":"IF(F22<>\"ja\",0,IF(C22=\"\",0,AF22*VLOOKUP(C22,Lijsten!$P$3:$Q$6,2,FALSE)))","v":0},null,{"$f":"IF(H22<>\"ja\",0,IF(C22=\"\",0,VLOOKUP(C22,Lijsten!$P$9:$Q$13,2,FALSE)))","v":0},null,{"$f":"IF($C22=\"\",0,IF(J22<>\"ja\",0,Z22*VLOOKUP($C22,Lijsten!$P$16:$Q$19,2,FALSE)))","v":0},null,{"$f":"IF($C22=\"\",0,IF(L22<>\"ja\",0,VLOOKUP($C22,Lijsten!$P$23:$Q$26,2,FALSE)))","v":0},null,{"$f":"IF($E22=\"\",0,IF(N22<>\"ja\",0,VLOOKUP($E22,Lijsten!$P$30:$Q$31,2,FALSE)))","v":0},0,false,{"$f":"AND(C22=\"Kat\",E22=\"\")","v":false},0,0,0,null,0,0,0,1,null,0,0,0,0,1]
[{"$f":"IF(C23=\"\",0,VLOOKUP(C23,Lijsten!$P$3:$R$6,3,FALSE))","v":0},null,null,null,null,null,{"$f":"IF(F23<>\"ja\",0,IF(C23=\"\",0,AF23*VLOOKUP(C23,Lijsten!$P$3:$Q$6,2,FALSE)))","v":0},null,{"$f":"IF(H23<>\"ja\",0,IF(C23=\"\",0,VLOOKUP(C23,Lijsten!$P$9:$Q$13,2,FALSE)))","v":0},null,{"$f":"IF($C23=\"\",0,IF(J23<>\"ja\",0,Z23*VLOOKUP($C23,Lijsten!$P$16:$Q$19,2,FALSE)))","v":0},null,{"$f":"IF($C23=\"\",0,IF(L23<>\"ja\",0,VLOOKUP($C23,Lijsten!$P$23:$Q$26,2,FALSE)))","v":0},null,{"$f":"IF($E23=\"\",0,IF(N23<>\"ja\",0,VLOOKUP($E23,Lijsten!$P$30:$Q$31,2,FALSE)))","v":0},0,false,false,0,0,0,null,0,0,0,1,null,0,0,0,0,1]
[{"$f":"IF(C24=\"\",0,VLOOKUP(C24,Lijsten!$P$3:$R$6,3,FALSE))","v":0},null,null,null,null,null,{"$f":"IF(F24<>\"ja\",0,IF(C24=\"\",0,AF24*VLOOKUP(C24,Lijsten!$P$3:$Q$6,2,FALSE)))","v":0},null,{"$f":"IF(H24<>\"ja\",0,IF(C24=\"\",0,VLOOKUP(C24,Lijsten!$P$9:$Q$13,2,FALSE)))","v":0},null,{"$f":"IF($C24=\"\",0,IF(J24<>\"ja\",0,Z24*VLOOKUP($C24,Lijsten!$P$16:$Q$19,2,FALSE)))","v":0},null,{"$f":"IF($C24=\"\",0,IF(L24<>\"ja\",0,VLOOKUP($C24,Lijsten!$P$23:$Q$26,2,FALSE)))","v":0},null,{"$f":"IF($E24=\"\",0,IF(N24<>\"ja\",0,VLOOKUP($E24,Lijsten!$P$30:$Q$31,2,FALSE)))","v":0},0,false,false,0,0,0,null,0,0,0,1,null,0,0,0,0,1]
[{"$f":"IF(C25=\"\",0,VLOOKUP(C25,Lijsten!$P$3:$R$6,3,FALSE))","v":0},null,null,null,null,null,{"$f":"IF(F25<>\"ja\",0,IF(C25=\"\",0,AF25*VLOOKUP(C25,Lijsten!$P$3:$Q$6,2,FALSE)))","v":0},null,{"$f":"IF(H25<>\"ja\",0,IF(C25=\"\",0,VLOOKUP(C25,Lijsten!$P$9:$Q$13,2,FALSE)))","v":0},null,{"$f":"IF($C25=\"\",0,IF(J25<>\"ja\",0,Z25*VLOOKUP($C25,Lijsten!$P$16:$Q$19,2,FALSE)))","v":0},null,{"$f":"IF($C25=\"\",0,IF(L25<>\"ja\",0,VLOOKUP($C25,Lijsten!$P$23:$Q$26,2,FALSE)))","v":0},null,{"$f":"IF($E25=\"\",0,IF(N25<>\"ja\",0,VLOOKUP($E25,Lijsten!$P$30:$Q$31,2,FALSE)))","v":0},0,false,false,0,0,0,null,0,0,0,1,null,0,0,0,0,1]
[{"$f":"IF(C26=\"\",0,VLOOKUP(C26,Lijsten!$P$3:$R$6,3,FALSE))","v":0},null,null,null,null,null,{"$f":"IF(F26<>\"ja\",0,IF(C26=\"\",0,AF26*VLOOKUP(C26,Lijsten!$P$3:$Q$6,2,FALSE)))","v":0},null,{"$f":"IF(H26<>\"ja\",0,IF(C26=\"\",0,VLOOKUP(C26,Lijsten!$P$9:$Q$13,2,FALSE)))","v":0},null,{"$f":"IF($C26=\"\",0,IF(J26<>\"ja\",0,Z26*VLOOKUP($C26,Lijsten!$P$16:$Q$19,2,FALSE)))","v":0},null,{"$f":"IF($C26=\"\",0,IF(L26<>\"ja\",0,VLOOKUP($C26,Lijsten!$P$23:$Q$26,2,FALSE)))","v":0},null,{"$f":"IF($E26=\"\",0,IF(N26<>\"ja\",0,VLOOKUP($E26,Lijsten!$P$30:$Q$31,2,FALSE)))","v":0},0,false,false,0,0,0,null,0,0,0,1,null,0,0,0,0,1]
[{"$f":"IF(C27=\"\",0,VLOOKUP(C27,Lijsten!$P$3:$R$6,3,FALSE))","v":0},null,null,null,null,null,{"$f":"IF(F27<>\"ja\",0,IF(C27=\"\",0,AF27*VLOOKUP(C27,Lijsten!$P$3:$Q$6,2,FALSE)))","v":0},null,{"$f":"IF(H27<>\"ja\",0,IF(C27=\"\",0,VLOOKUP(C27,Lijsten!$P$9:$Q$13,2,FALSE)))","v":0},null,{"$f":"IF($C27=\"\",0,IF(J27<>\"ja\",0,Z27*VLOOKUP($C27,Lijsten!$P$16:$Q$19,2,FALSE)))","v":0},null,{"$f":"IF($C27=\"\",0,IF(L27<>\"ja\",0,VLOOKUP($C27,Lijsten!$P$23:$Q$26,2,FALSE)))","v":0},null,{"$f":"IF($E27=\"\",0,IF(N27<>\"ja\",0,VLOOKUP($E27,Lijsten!$P$30:$Q$31,2,FALSE)))","v":0},0,false,false,0,0,0,null,0,0,0,1,null,0,0,0,0,1]
[{"$f":"IF(C28=\"\",0,VLOOKUP(C28,Lijsten!$P$3:$R$6,3,FALSE))","v":0},null,null,null,null,null,{"$f":"IF(F28<>\"ja\",0,IF(C28=\"\",0,AF28*VLOOKUP(C28,Lijsten!$P$3:$Q$6,2,FALSE)))","v":0},null,{"$f":"IF(H28<>\"ja\",0,IF(C28=\"\",0,VLOOKUP(C28,Lijsten!$P$9:$Q$13,2,FALSE)))","v":0},null,{"$f":"IF($C28=\"\",0,IF(J28<>\"ja\",0,Z28*VLOOKUP($C28,Lijsten!$P$16:$Q$19,2,FALSE)))","v":0},null,{"$f":"IF($C28=\"\",0,IF(L28<>\"ja\",0,VLOOKUP($C28,Lijsten!$P$23:$Q$26,2,FALSE)))","v":0},null,{"$f":"IF($E28=\"\",0,IF(N28<>\"ja\",0,VLOOKUP($E28,Lijsten!$P$30:$Q$31,2,FALSE)))","v":0},0,false,false,0,0,0,null,0,0,0,1,null,0,0,0,0,1]
[{"$f":"IF(C29=\"\",0,VLOOKUP(C29,Lijsten!$P$3:$R$6,3,FALSE))","v":0},null,null,null,null,null,{"$f":"IF(F29<>\"ja\",0,IF(C29=\"\",0,AF29*VLOOKUP(C29,Lijsten!$P$3:$Q$6,2,FALSE)))","v":0},null,{"$f":"IF(H29<>\"ja\",0,IF(C29=\"\",0,VLOOKUP(C29,Lijsten!$P$9:$Q$13,2,FALSE)))","v":0},null,{"$f":"IF($C29=\"\",0,IF(J29<>\"ja\",0,Z29*VLOOKUP($C29,Lijsten!$P$16:$Q$19,2,FALSE)))","v":0},null,{"$f":"IF($C29=\"\",0,IF(L29<>\"ja\",0,VLOOKUP($C29,Lijsten!$P$23:$Q$26,2,FALSE)))","v":0},null,{"$f":"IF($E29=\"\",0,IF(N29<>\"ja\",0,VLOOKUP($E29,Lijsten!$P$30:$Q$31,2,FALSE)))","v":0},{"$f":"G29+I29+K29+M29+O29","v":0},false,{"$f":"AND(C29=\"Kat\",E29=\"\")","v":false},0,{"$f":"IF(AND(C29<> \"Kleine Herkauwer\",C29<>\"\",D29=\"\"),1,0)","v":0},{"$f":"IF(AND(B29&D29&E29&F29&H29&J29&L29&N29<>\"\",C29=\"\"),1,0)","v":0},null,{"$f":"IF(AND(C29=\"Hond\",J29=\"ja\",OR(F29<>\"ja\",H29<>\"ja\")),1,0)","v":0},{"$f":"IF(AND(C29=\"Paard/Pony/Ezel\",J29=\"ja\",OR(F29<>\"ja\",H29<>\"ja\")),1,0)","v":0},0,{"$f":"IF(Y29=0,1,0)","v":1},null,{"$f":"IF(OR(AND(A29=1,F29=\"ja\",H29<>\"ja\"),AND(A29=1,F29=\"ja\",J29<>\"ja\")),1,0)","v":0},{"$f":"IF(OR(AND(A29=4,F29=\"ja\",H29<>\"ja\"),AND(A29=4,F29=\"ja\",J29<>\"ja\")),1,0)","v":0},{"$f":"IF(AND(A29=2,F29=\"ja\",H29<>\"ja\"),1,0)","v":0},{"$f":"AB29+AC29+AD29","v":0},{"$f":"IF(AE29=0,1,0)","v":1}]
[{"$f":"IF(C30=\"\",0,VLOOKUP(C30,Lijsten!$P$3:$R$6,3,FALSE))","v":0},null,null,null,null,null,{"$f":"IF(F30<>\"ja\",0,IF(C30=\"\",0,AF30*VLOOKUP(C30,Lijsten!$P$3:$Q$6,2,FALSE)))","v":0},null,{"$f":"IF(H30<>\"ja\",0,IF(C30=\"\",0,VLOOKUP(C30,Lijsten!$P$9:$Q$13,2,FALSE)))","v":0},null,{"$f":"IF($C30=\"\",0,IF(J30<>\"ja\",0,Z30*VLOOKUP($C30,Lijsten!$P$16:$Q$19,2,FALSE)))","v":0},null,{"$f":"IF($C30=\"\",0,IF(L30<>\"ja\",0,VLOOKUP($C30,Lijsten!$P$23:$Q$26,2,FALSE)))","v":0},null,{"$f":"IF($E30=\"\",0,IF(N30<>\"ja\",0,VLOOKUP($E30,Lijsten!$P$30:$Q$31,2,FALSE)))","v":0},0,false,{"$f":"AND(C30=\"Kat\",E30=\"\")","v":false},0,0,0,null,0,0,0,1,null,{"$f":"IF(OR(AND(A30=1,F30=\"ja\",H30<>\"ja\"),AND(A30=1,F30=\"ja\",J30<>\"ja\")),1,0)","v":0},0,0,0,1]
[{"$f":"IF(C31=\"\",0,VLOOKUP(C31,Lijsten!$P$3:$R$6,3,FALSE))","v":0},null,null,null,null,null,{"$f":"IF(F31<>\"ja\",0,IF(C31=\"\",0,AF31*VLOOKUP(C31,Lijsten!$P$3:$Q$6,2,FALSE)))","v":0},null,{"$f":"IF(H31<>\"ja\",0,IF(C31=\"\",0,VLOOKUP(C31,Lijsten!$P$9:$Q$13,2,FALSE)))","v":0},null,{"$f":"IF($C31=\"\",0,IF(J31<>\"ja\",0,Z31*VLOOKUP($C31,Lijsten!$P$16:$Q$19,2,FALSE)))","v":0},null,{"$f":"IF($C31=\"\",0,IF(L31<>\"ja\",0,VLOOKUP($C31,Lijsten!$P$23:$Q$26,2,FALSE)))","v":0},null,{"$f":"IF($E31=\"\",0,IF(N31<>\"ja\",0,VLOOKUP($E31,Lijsten!$P$30:$Q$31,2,FALSE)))","v":0},0,false,false,0,0,0,null,0,0,0,1,null,0,0,0,0,1]
[{"$f":"IF(C32=\"\",0,VLOOKUP(C32,Lijsten!$P$3:$R$6,3,FALSE))","v":0},null,null,null,null,null,{"$f":"IF(F32<>\"ja\",0,IF(C32=\"\",0,AF32*VLOOKUP(C32,Lijsten!$P$3:$Q$6,2,FALSE)))","v":0},null,{"$f":"IF(H32<>\"ja\",0,IF(C32=\"\",0,VLOOKUP(C32,Lijsten!$P$9:$Q$13,2,FALSE)))","v":0},null,{"$f":"IF($C32=\"\",0,IF(J32<>\"ja\",0,Z32*VLOOKUP($C32,Lijsten!$P$16:$Q$19,2,FALSE)))","v":0},null,{"$f":"IF($C32=\"\",0,IF(L32<>\"ja\",0,VLOOKUP($C32,Lijsten!$P$23:$Q$26,2,FALSE)))","v":0},null,{"$f":"IF($E32=\"\",0,IF(N32<>\"ja\",0,VLOOKUP($E32,Lijsten!$P$30:$Q$31,2,FALSE)))","v":0},0,false,false,0,0,0,null,0,0,0,1,null,0,0,0,0,1]
[{"$f":"IF(C33=\"\",0,VLOOKUP(C33,Lijsten!$P$3:$R$6,3,FALSE))","v":0},null,null,null,null,null,{"$f":"IF(F33<>\"ja\",0,IF(C33=\"\",0,AF33*VLOOKUP(C33,Lijsten!$P$3:$Q$6,2,FALSE)))","v":0},null,{"$f":"IF(H33<>\"ja\",0,IF(C33=\"\",0,VLOOKUP(C33,Lijsten!$P$9:$Q$13,2,FALSE)))","v":0},null,{"$f":"IF($C33=\"\",0,IF(J33<>\"ja\",0,Z33*VLOOKUP($C33,Lijsten!$P$16:$Q$19,2,FALSE)))","v":0},null,{"$f":"IF($C33=\"\",0,IF(L33<>\"ja\",0,VLOOKUP($C33,Lijsten!$P$23:$Q$26,2,FALSE)))","v":0},null,{"$f":"IF($E33=\"\",0,IF(N33<>\"ja\",0,VLOOKUP($E33,Lijsten!$P$30:$Q$31,2,FALSE)))","v":0},0,false,false,0,0,0,null,0,0,0,1,null,0,0,0,0,1]
[{"$f":"IF(C34=\"\",0,VLOOKUP(C34,Lijsten!$P$3:$R$6,3,FALSE))","v":0},null,null,null,null,null,{"$f":"IF(F34<>\"ja\",0,IF(C34=\"\",0,AF34*VLOOKUP(C34,Lijsten!$P$3:$Q$6,2,FALSE)))","v":0},null,{"$f":"IF(H34<>\"ja\",0,IF(C34=\"\",0,VLOOKUP(C34,Lijsten!$P$9:$Q$13,2,FALSE)))","v":0},null,{"$f":"IF($C34=\"\",0,IF(J34<>\"ja\",0,Z34*VLOOKUP($C34,Lijsten!$P$16:$Q$19,2,FALSE)))","v":0},null,{"$f":"IF($C34=\"\",0,IF(L34<>\"ja\",0,VLOOKUP($C34,Lijsten!$P$23:$Q$26,2,FALSE)))","v":0},null,{"$f":"IF($E34=\"\",0,IF(N34<>\"ja\",0,VLOOKUP($E34,Lijsten!$P$30:$Q$31,2,FALSE)))","v":0},0,false,{"$f":"AND(C34=\"Kat\",E34=\"\")","v":false},0,0,0,null,0,0,0,1,null,0,0,0,0,1]
[{"$f":"IF(C35=\"\",0,VLOOKUP(C35,Lijsten!$P$3:$R$6,3,FALSE))","v":0},null,null,null,null,null,{"$f":"IF(F35<>\"ja\",0,IF(C35=\"\",0,AF35*VLOOKUP(C35,Lijsten!$P$3:$Q$6,2,FALSE)))","v":0},null,{"$f":"IF(H35<>\"ja\",0,IF(C35=\"\",0,VLOOKUP(C35,Lijsten!$P$9:$Q$13,2,FALSE)))","v":0},null,{"$f":"IF($C35=\"\",0,IF(J35<>\"ja\",0,Z35*VLOOKUP($C35,Lijsten!$P$16:$Q$19,2,FALSE)))","v":0},null,{"$f":"IF($C35=\"\",0,IF(L35<>\"ja\",0,VLOOKUP($C35,Lijsten!$P$23:$Q$26,2,FALSE)))","v":0},null,{"$f":"IF($E35=\"\",0,IF(N35<>\"ja\",0,VLOOKUP($E35,Lijsten!$P$30:$Q$31,2,FALSE)))","v":0},0,false,{"$f":"AND(C35=\"Kat\",E35=\"\")","v":false},0,0,0,null,0,0,0,1,null,0,0,0,0,1]
[{"$f":"IF(C36=\"\",0,VLOOKUP(C36,Lijsten!$P$3:$R$6,3,FALSE))","v":0},null,null,null,null,null,{"$f":"IF(F36<>\"ja\",0,IF(C36=\"\",0,AF36*VLOOKUP(C36,Lijsten!$P$3:$Q$6,2,FALSE)))","v":0},null,{"$f":"IF(H36<>\"ja\",0,IF(C36=\"\",0,VLOOKUP(C36,Lijsten!$P$9:$Q$13,2,FALSE)))","v":0},null,{"$f":"IF($C36=\"\",0,IF(J36<>\"ja\",0,Z36*VLOOKUP($C36,Lijsten!$P$16:$Q$19,2,FALSE)))","v":0},null,{"$f":"IF($C36=\"\",0,IF(L36<>\"ja\",0,VLOOKUP($C36,Lijsten!$P$23:$Q$26,2,FALSE)))","v":0},null,{"$f":"IF($E36=\"\",0,IF(N36<>\"ja\",0,VLOOKUP($E36,Lijsten!$P$30:$Q$31,2,FALSE)))","v":0},0,false,false,0,0,0,null,0,0,0,1,null,0,0,0,0,1]
[{"$f":"IF(C37=\"\",0,VLOOKUP(C37,Lijsten!$P$3:$R$6,3,FALSE))","v":0},null,null,null,null,null,{"$f":"IF(F37<>\"ja\",0,IF(C37=\"\",0,AF37*VLOOKUP(C37,Lijsten!$P$3:$Q$6,2,FALSE)))","v":0},null,{"$f":"IF(H37<>\"ja\",0,IF(C37=\"\",0,VLOOKUP(C37,Lijsten!$P$9:$Q$13,2,FALSE)))","v":0},null,{"$f":"IF($C37=\"\",0,IF(J37<>\"ja\",0,Z37*VLOOKUP($C37,Lijsten!$P$16:$Q$19,2,FALSE)))","v":0},null,{"$f":"IF($C37=\"\",0,IF(L37<>\"ja\",0,VLOOKUP($C37,Lijsten!$P$23:$Q$26,2,FALSE)))","v":0},null,{"$f":"IF($E37=\"\",0,IF(N37<>\"ja\",0,VLOOKUP($E37,Lijsten!$P$30:$Q$31,2,FALSE)))","v":0},0,false,false,0,0,0,null,0,0,0,1,null,0,0,0,0,1]
[{"$f":"IF(C38=\"\",0,VLOOKUP(C38,Lijsten!$P$3:$R$6,3,FALSE))","v":0},null,null,null,null,null,{"$f":"IF(F38<>\"ja\",0,IF(C38=\"\",0,AF38*VLOOKUP(C38,Lijsten!$P$3:$Q$6,2,FALSE)))","v":0},null,{"$f":"IF(H38<>\"ja\",0,IF(C38=\"\",0,VLOOKUP(C38,Lijsten!$P$9:$Q$13,2,FALSE)))","v":0},null,{"$f":"IF($C38=\"\",0,IF(J38<>\"ja\",0,Z38*VLOOKUP($C38,Lijsten!$P$16:$Q$19,2,FALSE)))","v":0},null,{"$f":"IF($C38=\"\",0,IF(L38<>\"ja\",0,VLOOKUP($C38,Lijsten!$P$23:$Q$26,2,FALSE)))","v":0},null,{"$f":"IF($E38=\"\",0,IF(N38<>\"ja\",0,VLOOKUP($E38,Lijsten!$P$30:$Q$31,2,FALSE)))","v":0},0,false,false,0,0,0,null,0,0,0,1,null,0,0,0,0,1]
[{"$f":"IF(C39=\"\",0,VLOOKUP(C39,Lijsten!$P$3:$R$6,3,FALSE))","v":0},null,null,null,null,null,{"$f":"IF(F39<>\"ja\",0,IF(C39=\"\",0,AF39*VLOOKUP(C39,Lijsten!$P$3:$Q$6,2,FALSE)))","v":0},null,{"$f":"IF(H39<>\"ja\",0,IF(C39=\"\",0,VLOOKUP(C39,Lijsten!$P$9:$Q$13,2,FALSE)))","v":0},null,{"$f":"IF($C39=\"\",0,IF(J39<>\"ja\",0,Z39*VLOOKUP($C39,Lijsten!$P$16:$Q$19,2,FALSE)))","v":0},null,{"$f":"IF($C39=\"\",0,IF(L39<>\"ja\",0,VLOOKUP($C39,Lijsten!$P$23:$Q$26,2,FALSE)))","v":0},null,{"$f":"IF($E39=\"\",0,IF(N39<>\"ja\",0,VLOOKUP($E39,Lijsten!$P$30:$Q$31,2,FALSE)))","v":0},0,false,false,0,0,0,null,0,0,0,1,null,0,0,0,0,1]
[{"$f":"IF(C40=\"\",0,VLOOKUP(C40,Lijsten!$P$3:$R$6,3,FALSE))","v":0},null,null,null,null,null,{"$f":"IF(F40<>\"ja\",0,IF(C40=\"\",0,AF40*VLOOKUP(C40,Lijsten!$P$3:$Q$6,2,FALSE)))","v":0},null,{"$f":"IF(H40<>\"ja\",0,IF(C40=\"\",0,VLOOKUP(C40,Lijsten!$P$9:$Q$13,2,FALSE)))","v":0},null,{"$f":"IF($C40=\"\",0,IF(J40<>\"ja\",0,Z40*VLOOKUP($C40,Lijsten!$P$16:$Q$19,2,FALSE)))","v":0},null,{"$f":"IF($C40=\"\",0,IF(L40<>\"ja\",0,VLOOKUP($C40,Lijsten!$P$23:$Q$26,2,FALSE)))","v":0},null,{"$f":"IF($E40=\"\",0,IF(N40<>\"ja\",0,VLOOKUP($E40,Lijsten!$P$30:$Q$31,2,FALSE)))","v":0},0,false,false,0,0,0,null,0,0,0,1,null,0,0,0,0,1]
[]
[null,null,null,null,null,null,null,null,null,null,null,null,null,null,null,null,null,null,{"$f":"SUM(S11:S40)+SUM(T11:T40)+SUM(U11:U40)+SUM(Y11:Y40)+SUM(AE11:AE40)","v":0}]
[]
[]
[]
[]
[]
[]
[]
[]
[]
[]
[]
[]
[]
[]
[]
[]
[]
[]
[]
[]
[]
[]
[]
[]
[]
[]
[]
[]
[]
[]
[]
[]
[]
[]
[]
[]
[]
[]
[]
[]
[]
[]
[]
[]
[]
[]
[]
[]
[]
[]
[]
[]
[]
[]
[]
[]
[]
[]
[]
[]
[]
[]
[]
[]
[]
[]
[]
[]
[]
[]
[]
[]
[]
[]
[]
[]
[]
[]
[]
[]
[]
[]
[]
[]
[]
[]
[]
[]
[]
[]
[]
[]
[]
[]
[]
[]
[]
[]
[]
[]
[]
[]
[]
[]
[]
[]
[]
[]
[]
[]
[]
[]
[]
[]
[]
[]
[]
[]
[]
[]
[]
[]
[]
[]
[]
[]
[]
[]
[]
[]
[]
[]
[]
[]
[]
[]
[]
[]
[]
[]
[]
[]
[]
[]
[]
[]
[]
[]
[]
[]
[]
[]
[]
[]
[]
[]
[]
[]
[]
[]
[]
[]
[]
[]
[]
[]
[]
[]
[]
[]
[]
[]
[]
[]
[]
[]
[]
[]
[]
[]
[]
[]
[]
[]
[]
[]
[]
[]
[]
[]
[]
[]
[]
[]
[]
[]
[]
[]
[]
[]
[]
[]
[]
[]
[]
[]
[]
[]
[]
[]
[]
[]
[]
[]
[]
[]
[]
[]
[]
[]
[]
[]
[]
[]
[]
[]
[]
[]
[]
[]
[]
[]
[]
[]
[]
[]
[]
[]
[]
[]
[]
[]
[]
[]
[]
[]
[]
[]
[]
[]
[]
[]
[]
[]
[]
[]
[]
[]
[]
[]
[]
[]
[]
[]
[]
[]
[]
[]
[]
[]
[]
[]
[]
[]
[]
[]
[]
[]
[]
[]
[]
[]
[]
[]
[]
[]
[]
[]
[]
[]
[]
[]
[]
[]
[]
[]
[]
[]
[]
[]
[]
[]
[]
[]
[]
[]
[]
[]
[]
[]
[]
[]
[]
[]
[]
[]
[]
[]
[]
[]
[]
[]
[]
[]
[]
[]
[]
[]
[]
[]
[]
[]
[]
[]
[]
[]
[]
[]
[]
[]
[]
[]
[]
[]
[]
[]
[]
[]
[]
[]
[]
[]
[]
[]
[]
[]
[]
[]
[]
[]
[]
[]
[]
[]
[]
[]
[]
[]
[]
[]
[]
[]
[]
[]
[]
[]
[]
[]
[]
[]
[]
[]
[]
[]
[]
[]
[]
[]
[]
[]
[]
[]
[]
[]
[]
[]
[]
[]
[]
[]
[]
[]
[]
[]
[]
[]
[]
[]
[]
[]
[]
[]
[]
[]
[]
[]
[]
[]
[]
[]
[]
[]
[]
[]
[]
[]
[]
[]
[]
[]
[]
[]
[]
[]
[]
[]
[]
[]
[]
[]
[]
[]
[]
[]
[]
[]
[]
[]
[]
[]
[]
[]
[]
[]
[]
[]
[]
[]
[]
[]
[]
[]
[]
[]
[]
[]
[]
[]
[]
[]
[]
[]
[]
[]
[]
[]
[]
[]
[]
[]
[]
[]
[]
[]
[]
[]
[]
[]
[]
[]
[]
[]
[]
[]
[]
[]
[]
[]
[]
[]
[]
[]
[]
[]
[]
[]
[]
[]
[]
[]
[]
[]
[]
[]
[]
[]
[]
[]
[]
[]
[]
[]
[]
[]
[]
[]
[]
[]
[]
[]
[]
[]
[]
[]
[]
[]
[]
[]
[]
[]
[]
[]
[]
[]
[]
[]
[]
[]
[]
[]
[]
[]
[]
[]
[]
[]
[]
[]
[]
[]
[]
[]
[]
[]
[]
[]
[]
[]
[]
[]
[]
[]
[]
[]
[]
[]
[]
[]
[]
[]
[]
[]
[]
[]
[]
[]
[]
[]
[]
[]
[]
[]
[]
[]
[]
[]
[]
[]
[]
[]
[]
[]
[]
[]
[]
[]
[]
[]
[]
[]
[]
[]
[]
[]
[]
[]
[]
[]
[]
[]
[]
[]
[]
[]
[]
[]
[]
[]
[]
[]
[]
[]
[]
[]
[]
[]
[]
[]
[]
[]
[]
[]
[]
[]
[]
[]
[]
[]
[]
[]
[]
[]
[]
[]
[]
[]
[]
[]
[]
[]
[]
[]
[]
[]
[]
[]
[]
[]
[]
[]
[]
[]
[]
[]
[]
[]
[]
[]
[]
[]
[]
[]
[]
[]
[]
[]
[]
[]
[]
[]
[]
[]
[]
[]
[]
[]
[]
[]
[]
[]
[]
[]
[]
[]
[]
[]
[]
[]
[]
[]
[]
[]
[]
[]
[]
[]
[]
[]
[]
[]
[]
[]
[]
[]
[]
[]
[]
[]
[]
[]
[]
[]
[]
[]
[]
[]
[]
[]
[]
[]
[]
[]
[]
[]
[]
[]
[]
[]
[]
[]
[]
[]
[]
[]
[]
[]
[]
[]
[]
[]
[]
[]
[]
[]
[]
[]
[]
[]
[]
[]
[]
[]
[]
[]
[]
[]
[]
[]
[]
[]
[]
[]
[]
[]
[]
[]
[]
[]
[]
[]
[]
[]
[]
[]
[]
[]
[]
[]
[]
[]
[]
[]
[]
[]
[]
[]
[]
[]
[]
[]
[]
[]
[]
[]
[]
[]
[]
[]
[]
[]
[]
[]
[]
[]
[]
[]
[]
[]
[]
[]
[]
[]
[]
[]
[]
[]
[]
[]
[]
[]
[]
[]
[]
[]
[]
[]
[]
[]
[]
[]
[]
[]
[]
[]
[]
[]
[]
[]
[]
[]
[]
[]
[]
[]
[]
[]
[]
[]
[]
[]
[]
[]
[]
[]
[]
[]
[]
[]
[]
[]
[]
[]
[]
[]
[]
[]
[]
[]
[]
[]
[]
[]
[]
[]
[]
[]
[]
[]
[]
[]
[]
[]
[]
[]
[]
[]
[]
[]
[]
[]
[]
[]
[]
[]
[]
[]
[]
[]
[]
[]
[]
[]
[]
[]
[]
[]
[]
[]
[]
[]
[]
[]
[]
[]
[]
[]
[]
[]
[]
[]
[]
[]
[]
[]
[]
[]
[]
[]
[]
[]
[]
[]
[]
[]
[]
[]
[]
[]
[]
[]
[]
[]
[]
[]
[]
[]
[]
[]
[]
[]
[]
[]
[]
[]
[]
[]
[]
[]
[]
[]
[]
[]
[]
[]
[]
[]
[]
[]
[]
[]
[]
[]
[]
[]
[]
[]
[]
[]
[]
[]
[]
[]
[]
[]
[]
[null,null,null,null,{"$f":"IF(C1048<>\"\",VLOOKUP(C1048,Lijsten!$A$3:$C$4,2,FALSE),\"\")","v":""},{"$f":"IF(A1048<>\"\",VLOOKUP(A1048,Lijsten!$A$3:$C$4,3,FALSE),\"\")","v":""},{"$f":"IF(B1048<Afstanddrempel,C1048,C1048+(B1048-Afstanddrempel)*F1048)","v":0},null,null,null,null,null,null,{"$f":"IF(C1048<>\"\",VLOOKUP(C1048,Lijsten!$A$3:$C$4,3,FALSE),\"\")","v":""},{"$f":"IF(D1048<Afstanddrempel,E1048,E1048+(D1048-Afstanddrempel)*N1048)","v":""}]

{"sheet":"rapport-tab","index":6,"n_rows":138,"n_cols":11,"rows_kept":138,"cut":false,"hidden":true,"merged":[[7,0,7,3],[43,6,43,10],[55,7,55,10],[56,7,56,10],[57,7,57,10],[44,6,44,10],[45,6,45,10],[46,6,46,10],[49,7,49,10],[50,7,50,10],[51,7,51,10],[52,7,52,10],[53,7,53,10],[54,7,54,10],[47,6,47,10],[73,8,73,10],[74,8,74,10],[75,8,75,10],[76,8,76,10],[58,7,58,10],[60,7,60,10],[59,7,59,10],[68,8,68,10],[69,8,69,10],[70,8,70,10],[71,8,71,10],[72,8,72,10],[63,8,63,10],[64,8,64,10],[65,8,65,10],[66,8,66,10],[67,8,67,10],[78,8,78,10],[79,8,79,10],[80,8,80,10],[33,6,33,10],[34,6,34,10],[48,7,48,10],[35,6,35,10],[36,6,36,10],[37,6,37,10],[38,6,38,10],[39,6,39,10],[40,6,40,10],[41,6,41,10],[42,6,42,10],[77,8,77,10]]}
[null,null,null,null,null,null,null,null,null,null,{"$f":"Startpagina!B1","v":"versie 1.26"}]
[]
[]
[]
[]
["Facturatie dierenasielen"]
[]
[{"$f":"Startpagina!B8","v":"Naam dierenasiel"},null,null,null,{"$f":"Naam","v":0},{"$f":"Startpagina!D8","v":"verplicht veld"}]
[{"$f":"Startpagina!B9","v":"Erkenningsnummer (HK30999999)"},null,"",null,{"$f":"HKNummer","v":0},{"$f":"Startpagina!D9","v":"verplicht veld"}]
[{"$f":"Startpagina!B10","v":"Ondernemingsnummer (0999999999)"},null,null,null,{"$f":"KBONummer","v":0},{"$f":"Startpagina!D10","v":"verplicht veld"}]
[]
[{"$f":"Startpagina!B12","v":"Dossiernummer"},null,null,null,{"$f":"Dossiernummer","v":0},{"$f":"Startpagina!D12","v":"verplicht veld"}]
[{"$f":"Startpagina!B13","v":"Datum IBN  (dd/mm/jjjj) "},null,null,null,{"$f":"Startpagina!C13","v":0},{"$f":"Startpagina!D13","v":"verplicht veld"},{"$f":"Startpagina!E13","v":"maximaal 2 jaar terug in de tijd"},{"$f":"Startpagina!F13","v":"Tab Dierenarts pas invullen vanaf datum IBN 01/06/2023"}]
[{"$f":"Startpagina!B14","v":"Datum bestemmingsbeslissing  (dd/mm/jjjj)   (*)"},null,null,null,{"$f":"Startpagina!C14","v":"00:00:00"},{"$f":"Startpagina!D14","v":""}]
[{"$f":"Startpagina!B15","v":"Factuurdatum  (dd/mm/jjjj)"},null,null,null,{"$f":"Startpagina!C15","v":"00:00:00"},{"$f":"Startpagina!D15","v":"verplicht veld"},null,{"$f":"Startpagina!F15","v":"Factuurdatum vanaf 01/01/2022"}]
[{"$f":"Startpagina!B16","v":"Dit bestand is de bijlage bij factuur met nummer"},null,null,null,{"$f":"Startpagina!C16","v":0}]
[{"$f":"Startpagina!B17","v":"Bedrag op te nemen op de factuur"},null,null,null,{"$f":"Startpagina!C17","v":0}]
[]
[null,null,null,null,{"$f":"Startpagina!B19","v":"Uitsplitsing"}]
[null,null,null,{"$f":"Startpagina!B20","v":"Transport"},{"$f":"Startpagina!C20","v":0}]
[null,null,null,{"$f":"Startpagina!B21","v":"Individuele dieren"},{"$f":"Startpagina!C21","v":0}]
[null,null,null,{"$f":"Startpagina!B22","v":"Dieren per Interval"},{"$f":"Startpagina!C22","v":0}]
[null,null,null,{"$f":"Startpagina!B23","v":"Diergeneeskundig verslag"},{"$f":"Startpagina!C23","v":0},{"$f":"Startpagina!D23","v":"Niet van toepassing"}]
[null,null,null,{"$f":"Startpagina!B24","v":"Dierenartskosten"},{"$f":"Startpagina!C24","v":0},{"$f":"Startpagina!D24","v":"Niet van toepassing"}]
[]
[]
[" *  of datum ophaling door de eigenaar of, bij niet-ophaling, de uiterste datum voor ophaling zoals in de bestemmingsbeslissing vastgelegd"]
[]
["Het dierenasiel is verantwoordelijk voor de juistheid van alle aan de afdeling overgemaakte gegevens."]
[]
[]
[]
[{"$f":"$E$12","v":0},{"$f":"NOW()","v":"2023-09-22T15:35:42.090"},null,null,null,null,null,{"$f":"E8","v":0},null,null,{"$f":"E9","v":0}]
[null,null,null,null,null,null,{"$f":"Transport!H1","v":"TOTAAL"}]
[{"$f":"Transport!B2","v":"Transport"},null,null,null,null,null,{"$f":"Transport!H2","v":0}]
[{"$f":"Transport!B3","v":"Vervoermiddel"},{"$f":"Transport!C3","v":"Datum rit"},{"$f":"Transport!D3","v":"Aantal km (Heen en terug)"},{"$f":"Transport!E3","v":"Forfait km HT"},{"$f":"Transport!F3","v":"Km vergoeding boven forfait"},{"$f":"Transport!G3","v":"Totaal"},{"$f":"Transport!H3","v":"Commentaar"}]
[{"$f":"IF(Transport!B4=\"\",\"\",Transport!B4)","v":""},{"$f":"IF(Transport!B4=\"\",\"\",Transport!C4)","v":""},{"$f":"IF(Transport!D4=\"\",\"\",Transport!D4)","v":""},{"$f":"IF(Transport!E4=\"\",\"\",Transport!E4)","v":""},{"$f":"Transport!F4","v":""},{"$f":"Transport!G4","v":""},{"$f":"IF(Transport!H4=\"\",\"\",Transport!H4)","v":""}]
[{"$f":"IF(Transport!B5=\"\",\"\",Transport!B5)","v":""},{"$f":"IF(Transport!B5=\"\",\"\",Transport!C5)","v":""},{"$f":"IF(Transport!D5=\"\",\"\",Transport!D5)","v":""},{"$f":"IF(Transport!E5=\"\",\"\",Transport!E5)","v":""},{"$f":"Transport!F5","v":""},{"$f":"Transport!G5","v":""},{"$f":"IF(Transport!H5=\"\",\"\",Transport!H5)","v":""}]
[{"$f":"IF(Transport!B6=\"\",\"\",Transport!B6)","v":""},{"$f":"IF(Transport!B6=\"\",\"\",Transport!C6)","v":""},{"$f":"IF(Transport!D6=\"\",\"\",Transport!D6)","v":""},{"$f":"IF(Transport!E6=\"\",\"\",Transport!E6)","v":""},{"$f":"Transport!F6","v":""},{"$f":"Transport!G6","v":""},{"$f":"IF(Transport!H6=\"\",\"\",Transport!H6)","v":""}]
[{"$f":"IF(Transport!B7=\"\",\"\",Transport!B7)","v":""},{"$f":"IF(Transport!B7=\"\",\"\",Transport!C7)","v":""},{"$f":"IF(Transport!D7=\"\",\"\",Transport!D7)","v":""},{"$f":"IF(Transport!E7=\"\",\"\",Transport!E7)","v":""},{"$f":"Transport!F7","v":""},{"$f":"Transport!G7","v":""},{"$f":"IF(Transport!H7=\"\",\"\",Transport!H7)","v":""}]
[{"$f":"IF(Transport!B8=\"\",\"\",Transport!B8)","v":""},{"$f":"IF(Transport!B8=\"\",\"\",Transport!C8)","v":""},{"$f":"IF(Transport!D8=\"\",\"\",Transport!D8)","v":""},{"$f":"IF(Transport!E8=\"\",\"\",Transport!E8)","v":""},{"$f":"Transport!F8","v":""},{"$f":"Transport!G8","v":""},{"$f":"IF(Transport!H8=\"\",\"\",Transport!H8)","v":""}]
[{"$f":"IF(Transport!B9=\"\",\"\",Transport!B9)","v":""},{"$f":"IF(Transport!B9=\"\",\"\",Transport!C9)","v":""},{"$f":"IF(Transport!D9=\"\",\"\",Transport!D9)","v":""},{"$f":"IF(Transport!E9=\"\",\"\",Transport!E9)","v":""},{"$f":"Transport!F9","v":""},{"$f":"Transport!G9","v":""},{"$f":"IF(Transport!H9=\"\",\"\",Transport!H9)","v":""}]
[{"$f":"IF(Transport!B10=\"\",\"\",Transport!B10)","v":""},{"$f":"IF(Transport!B10=\"\",\"\",Transport!C10)","v":""},{"$f":"IF(Transport!D10=\"\",\"\",Transport!D10)","v":""},{"$f":"IF(Transport!E10=\"\",\"\",Transport!E10)","v":""},{"$f":"Transport!F10","v":""},{"$f":"Transport!G10","v":""},{"$f":"IF(Transport!H10=\"\",\"\",Transport!H10)","v":""}]
[{"$f":"IF(Transport!B11=\"\",\"\",Transport!B11)","v":""},{"$f":"IF(Transport!B11=\"\",\"\",Transport!C11)","v":""},{"$f":"IF(Transport!D11=\"\",\"\",Transport!D11)","v":""},{"$f":"IF(Transport!E11=\"\",\"\",Transport!E11)","v":""},{"$f":"Transport!F11","v":""},{"$f":"Transport!G11","v":""},{"$f":"IF(Transport!H11=\"\",\"\",Transport!H11)","v":""}]
[{"$f":"IF(Transport!B12=\"\",\"\",Transport!B12)","v":""},{"$f":"IF(Transport!B12=\"\",\"\",Transport!C12)","v":""},{"$f":"IF(Transport!D12=\"\",\"\",Transport!D12)","v":""},{"$f":"IF(Transport!E12=\"\",\"\",Transport!E12)","v":""},{"$f":"Transport!F12","v":""},{"$f":"Transport!G12","v":""},{"$f":"IF(Transport!H12=\"\",\"\",Transport!H12)","v":""}]
[{"$f":"IF(Transport!B13=\"\",\"\",Transport!B13)","v":""},{"$f":"IF(Transport!B13=\"\",\"\",Transport!C13)","v":""},{"$f":"IF(Transport!D13=\"\",\"\",Transport!D13)","v":""},{"$f":"IF(Transport!E13=\"\",\"\",Transport!E13)","v":""},{"$f":"Transport!F13","v":""},{"$f":"Transport!G13","v":""},{"$f":"IF(Transport!H13=\"\",\"\",Transport!H13)","v":""}]
[{"$f":"IF(Transport!B14=\"\",\"\",Transport!B14)","v":""},{"$f":"IF(Transport!B14=\"\",\"\",Transport!C14)","v":""},{"$f":"IF(Transport!D14=\"\",\"\",Transport!D14)","v":""},{"$f":"IF(Transport!E14=\"\",\"\",Transport!E14)","v":""},{"$f":"Transport!F14","v":""},{"$f":"Transport!G14","v":""},{"$f":"IF(Transport!H14=\"\",\"\",Transport!H14)","v":""}]
[null,{"$f":"IF(Transport!B18=\"\",\"\",Transport!C18)","v":""},{"$f":"IF(Transport!D18=\"\",\"\",Transport!D18)","v":""},{"$f":"IF(Transport!E18=\"\",\"\",Transport!E18)","v":""},{"$f":"Transport!F18","v":""},{"$f":"Transport!G18","v":""},{"$f":"IF(Transport!H18=\"\",\"\",Transport!H18)","v":""}]
[null,null,null,null,null,null,null,{"$f":"'Individuele dieren'!I1","v":"TOTAAL"}]
[{"$f":"'Individuele dieren'!B2","v":"Individuele dieren"},null,null,null,null,null,null,{"$f":"'Individuele dieren'!I2","v":0}]
[{"$f":"'Individuele dieren'!B3","v":"Diersoort"},{"$f":"'Individuele dieren'!C3","v":"Tarief per dier"},{"$f":"'Individuele dieren'!D3","v":"Aantal"},{"$f":"'Individuele dieren'!E3","v":"Datum in"},{"$f":"'Individuele dieren'!F3","v":"Datum uit"},{"$f":"'Individuele dieren'!G3","v":"Aantal dagen"},{"$f":"'Individuele dieren'!H3","v":"Totaal"},{"$f":"'Individuele dieren'!I3","v":"Commentaar"}]
[{"$f":"IF('Individuele dieren'!B4>0,'Individuele dieren'!B4,\"\")","v":""},{"$f":"IF('Individuele dieren'!C4>0,'Individuele dieren'!C4,\"\")","v":""},{"$f":"IF('Individuele dieren'!B4>0,'Individuele dieren'!D4,\"\")","v":""},{"$f":"IF('Individuele dieren'!B4>0,'Individuele dieren'!E4,\"\")","v":""},{"$f":"IF('Individuele dieren'!B4>0,'Individuele dieren'!F4,\"\")","v":""},{"$f":"IF('Individuele dieren'!B4>0,'Individuele dieren'!G4,\"\")","v":""},{"$f":"IF('Individuele dieren'!H4>0,'Individuele dieren'!H4,\"\")","v":""},{"$f":"IF('Individuele dieren'!I4>0,'Individuele dieren'!I4,\"\")","v":""}]
[{"$f":"IF('Individuele dieren'!B5>0,'Individuele dieren'!B5,\"\")","v":""},{"$f":"IF('Individuele dieren'!C5>0,'Individuele dieren'!C5,\"\")","v":""},{"$f":"IF('Individuele dieren'!B5>0,'Individuele dieren'!D5,\"\")","v":""},{"$f":"IF('Individuele dieren'!B5>0,'Individuele dieren'!E5,\"\")","v":""},{"$f":"IF('Individuele dieren'!B5>0,'Individuele dieren'!F5,\"\")","v":""},{"$f":"IF('Individuele dieren'!B5>0,'Individuele dieren'!G5,\"\")","v":""},{"$f":"IF('Individuele dieren'!H5>0,'Individuele dieren'!H5,\"\")","v":""},{"$f":"IF('Individuele dieren'!I5>0,'Individuele dieren'!I5,\"\")","v":""}]
[{"$f":"IF('Individuele dieren'!B6>0,'Individuele dieren'!B6,\"\")","v":""},{"$f":"IF('Individuele dieren'!C6>0,'Individuele dieren'!C6,\"\")","v":""},{"$f":"IF('Individuele dieren'!B6>0,'Individuele dieren'!D6,\"\")","v":""},{"$f":"IF('Individuele dieren'!B6>0,'Individuele dieren'!E6,\"\")","v":""},{"$f":"IF('Individuele dieren'!B6>0,'Individuele dieren'!F6,\"\")","v":""},{"$f":"IF('Individuele dieren'!B6>0,'Individuele dieren'!G6,\"\")","v":""},{"$f":"IF('Individuele dieren'!H6>0,'Individuele dieren'!H6,\"\")","v":""},{"$f":"IF('Individuele dieren'!I6>0,'Individuele dieren'!I6,\"\")","v":""}]
[{"$f":"IF('Individuele dieren'!B7>0,'Individuele dieren'!B7,\"\")","v":""},{"$f":"IF('Individuele dieren'!C7>0,'Individuele dieren'!C7,\"\")","v":""},{"$f":"IF('Individuele dieren'!B7>0,'Individuele dieren'!D7,\"\")","v":""},{"$f":"IF('Individuele dieren'!B7>0,'Individuele dieren'!E7,\"\")","v":""},{"$f":"IF('Individuele dieren'!B7>0,'Individuele dieren'!F7,\"\")","v":""},{"$f":"IF('Individuele dieren'!B7>0,'Individuele dieren'!G7,\"\")","v":""},{"$f":"IF('Individuele dieren'!H7>0,'Individuele dieren'!H7,\"\")","v":""},{"$f":"IF('Individuele dieren'!I7>0,'Individuele dieren'!I7,\"\")","v":""}]
[{"$f":"IF('Individuele dieren'!B8>0,'Individuele dieren'!B8,\"\")","v":""},{"$f":"IF('Individuele dieren'!C8>0,'Individuele dieren'!C8,\"\")","v":""},{"$f":"IF('Individuele dieren'!B8>0,'Individuele dieren'!D8,\"\")","v":""},{"$f":"IF('Individuele dieren'!B8>0,'Individuele dieren'!E8,\"\")","v":""},{"$f":"IF('Individuele dieren'!B8>0,'Individuele dieren'!F8,\"\")","v":""},{"$f":"IF('Individuele dieren'!B8>0,'Individuele dieren'!G8,\"\")","v":""},{"$f":"IF('Individuele dieren'!H8>0,'Individuele dieren'!H8,\"\")","v":""},{"$f":"IF('Individuele dieren'!I8>0,'Individuele dieren'!I8,\"\")","v":""}]
[{"$f":"IF('Individuele dieren'!B9>0,'Individuele dieren'!B9,\"\")","v":""},{"$f":"IF('Individuele dieren'!C9>0,'Individuele dieren'!C9,\"\")","v":""},{"$f":"IF('Individuele dieren'!B9>0,'Individuele dieren'!D9,\"\")","v":""},{"$f":"IF('Individuele dieren'!B9>0,'Individuele dieren'!E9,\"\")","v":""},{"$f":"IF('Individuele dieren'!B9>0,'Individuele dieren'!F9,\"\")","v":""},{"$f":"IF('Individuele dieren'!B9>0,'Individuele dieren'!G9,\"\")","v":""},{"$f":"IF('Individuele dieren'!H9>0,'Individuele dieren'!H9,\"\")","v":""},{"$f":"IF('Individuele dieren'!I9>0,'Individuele dieren'!I9,\"\")","v":""}]
[{"$f":"IF('Individuele dieren'!B10>0,'Individuele dieren'!B10,\"\")","v":""},{"$f":"IF('Individuele dieren'!C10>0,'Individuele dieren'!C10,\"\")","v":""},{"$f":"IF('Individuele dieren'!B10>0,'Individuele dieren'!D10,\"\")","v":""},{"$f":"IF('Individuele dieren'!B10>0,'Individuele dieren'!E10,\"\")","v":""},{"$f":"IF('Individuele dieren'!B10>0,'Individuele dieren'!F10,\"\")","v":""},{"$f":"IF('Individuele dieren'!B10>0,'Individuele dieren'!G10,\"\")","v":""},{"$f":"IF('Individuele dieren'!H10>0,'Individuele dieren'!H10,\"\")","v":""},{"$f":"IF('Individuele dieren'!I10>0,'Individuele dieren'!I10,\"\")","v":""}]
[{"$f":"IF('Individuele dieren'!B11>0,'Individuele dieren'!B11,\"\")","v":""},{"$f":"IF('Individuele dieren'!C11>0,'Individuele dieren'!C11,\"\")","v":""},{"$f":"IF('Individuele dieren'!B11>0,'Individuele dieren'!D11,\"\")","v":""},{"$f":"IF('Individuele dieren'!B11>0,'Individuele dieren'!E11,\"\")","v":""},{"$f":"IF('Individuele dieren'!B11>0,'Individuele dieren'!F11,\"\")","v":""},{"$f":"IF('Individuele dieren'!B11>0,'Individuele dieren'!G11,\"\")","v":""},{"$f":"IF('Individuele dieren'!H11>0,'Individuele dieren'!H11,\"\")","v":""},{"$f":"IF('Individuele dieren'!I11>0,'Individuele dieren'!I11,\"\")","v":""}]
[{"$f":"IF('Individuele dieren'!B12>0,'Individuele dieren'!B12,\"\")","v":""},{"$f":"IF('Individuele dieren'!C12>0,'Individuele dieren'!C12,\"\")","v":""},{"$f":"IF('Individuele dieren'!B12>0,'Individuele dieren'!D12,\"\")","v":""},{"$f":"IF('Individuele dieren'!B12>0,'Individuele dieren'!E12,\"\")","v":""},{"$f":"IF('Individuele dieren'!B12>0,'Individuele dieren'!F12,\"\")","v":""},{"$f":"IF('Individuele dieren'!B12>0,'Individuele dieren'!G12,\"\")","v":""},{"$f":"IF('Individuele dieren'!H12>0,'Individuele dieren'!H12,\"\")","v":""},{"$f":"IF('Individuele dieren'!I12>0,'Individuele dieren'!I12,\"\")","v":""}]
[{"$f":"IF('Individuele dieren'!B13>0,'Individuele dieren'!B13,\"\")","v":""},{"$f":"IF('Individuele dieren'!C13>0,'Individuele dieren'!C13,\"\")","v":""},{"$f":"IF('Individuele dieren'!B13>0,'Individuele dieren'!D13,\"\")","v":""},{"$f":"IF('Individuele dieren'!B13>0,'Individuele dieren'!E13,\"\")","v":""},{"$f":"IF('Individuele dieren'!B13>0,'Individuele dieren'!F13,\"\")","v":""},{"$f":"IF('Individuele dieren'!B13>0,'Individuele dieren'!G13,\"\")","v":""},{"$f":"IF('Individuele dieren'!H13>0,'Individuele dieren'!H13,\"\")","v":""},{"$f":"IF('Individuele dieren'!I13>0,'Individuele dieren'!I13,\"\")","v":""}]
[]
[{"$f":"A95","v":0},{"$f":"NOW()","v":"2023-09-22T15:35:42.090"},null,null,null,null,null,{"$f":"H95","v":0},null,null,{"$f":"K95","v":0}]
[null,null,null,null,null,null,null,null,{"$f":"Interval!K1","v":"TOTAAL"}]
[{"$f":"Interval!B2","v":"Dieren per Interval"},null,null,null,null,null,null,null,{"$f":"Interval!K2","v":0}]
[{"$f":"Interval!B3","v":"In/Uitheems"},{"$f":"Interval!C3","v":"Diersoort"},{"$f":"Interval!D3","v":"Aantal"},{"$f":"Interval!F3","v":"Bedrag per interval"},{"$f":"Interval!G3","v":"Datum in"},{"$f":"Interval!H3","v":"Datum uit"},{"$f":"Interval!I3","v":"Aantal dagen"},{"$f":"Interval!J3","v":"Totaal"},{"$f":"Interval!K3","v":"Commentaar"}]
[{"$f":"IF(Interval!B4<>\"\",Interval!B4,\"\")","v":""},{"$f":"IF(Interval!C4<>\"\",Interval!C4,\"\")","v":""},{"$f":"IF(Interval!D4<>\"\",Interval!D4,\"\")","v":""},{"$f":"IF(Interval!F4=0,\"\",Interval!F4)","v":""},{"$f":"IF(Interval!F4=\"\",\"\",Interval!G4)","v":""},{"$f":"IF(Interval!F4=\"\",\"\",Interval!H4)","v":""},{"$f":"IF(Interval!C4<>\"\",Interval!I4,\"\")","v":""},{"$f":"IF(Interval!C4<>\"\",Interval!J4,\"\")","v":""},{"$f":"IF(Interval!K4<>\"\",Interval!K4,\"\")","v":""}]
[{"$f":"IF(Interval!B5<>\"\",Interval!B5,\"\")","v":""},{"$f":"IF(Interval!C5<>\"\",Interval!C5,\"\")","v":""},{"$f":"IF(Interval!D5<>\"\",Interval!D5,\"\")","v":""},{"$f":"IF(Interval!F5=0,\"\",Interval!F5)","v":""},{"$f":"IF(Interval!F5=\"\",\"\",Interval!G5)","v":""},{"$f":"IF(Interval!F5=\"\",\"\",Interval!H5)","v":""},{"$f":"IF(Interval!C5<>\"\",Interval!I5,\"\")","v":""},{"$f":"IF(Interval!C5<>\"\",Interval!J5,\"\")","v":""},{"$f":"IF(Interval!K5<>\"\",Interval!K5,\"\")","v":""}]
[{"$f":"IF(Interval!B6<>\"\",Interval!B6,\"\")","v":""},{"$f":"IF(Interval!C6<>\"\",Interval!C6,\"\")","v":""},{"$f":"IF(Interval!D6<>\"\",Interval!D6,\"\")","v":""},{"$f":"IF(Interval!F6=0,\"\",Interval!F6)","v":""},{"$f":"IF(Interval!F6=\"\",\"\",Interval!G6)","v":""},{"$f":"IF(Interval!F6=\"\",\"\",Interval!H6)","v":""},{"$f":"IF(Interval!C6<>\"\",Interval!I6,\"\")","v":""},{"$f":"IF(Interval!C6<>\"\",Interval!J6,\"\")","v":""},{"$f":"IF(Interval!K6<>\"\",Interval!K6,\"\")","v":""}]
[{"$f":"IF(Interval!B7<>\"\",Interval!B7,\"\")","v":""},{"$f":"IF(Interval!C7<>\"\",Interval!C7,\"\")","v":""},{"$f":"IF(Interval!D7<>\"\",Interval!D7,\"\")","v":""},{"$f":"IF(Interval!F7=0,\"\",Interval!F7)","v":""},{"$f":"IF(Interval!F7=\"\",\"\",Interval!G7)","v":""},{"$f":"IF(Interval!F7=\"\",\"\",Interval!H7)","v":""},{"$f":"IF(Interval!C7<>\"\",Interval!I7,\"\")","v":""},{"$f":"IF(Interval!C7<>\"\",Interval!J7,\"\")","v":""},{"$f":"IF(Interval!K7<>\"\",Interval!K7,\"\")","v":""}]
[{"$f":"IF(Interval!B8<>\"\",Interval!B8,\"\")","v":""},{"$f":"IF(Interval!C8<>\"\",Interval!C8,\"\")","v":""},{"$f":"IF(Interval!D8<>\"\",Interval!D8,\"\")","v":""},{"$f":"IF(Interval!F8=0,\"\",Interval!F8)","v":""},{"$f":"IF(Interval!F8=\"\",\"\",Interval!G8)","v":""},{"$f":"IF(Interval!F8=\"\",\"\",Interval!H8)","v":""},{"$f":"IF(Interval!C8<>\"\",Interval!I8,\"\")","v":""},{"$f":"IF(Interval!C8<>\"\",Interval!J8,\"\")","v":""},{"$f":"IF(Interval!K8<>\"\",Interval!K8,\"\")","v":""}]
[{"$f":"IF(Interval!B9<>\"\",Interval!B9,\"\")","v":""},{"$f":"IF(Interval!C9<>\"\",Interval!C9,\"\")","v":""},{"$f":"IF(Interval!D9<>\"\",Interval!D9,\"\")","v":""},{"$f":"IF(Interval!F9=0,\"\",Interval!F9)","v":""},{"$f":"IF(Interval!F9=\"\",\"\",Interval!G9)","v":""},{"$f":"IF(Interval!F9=\"\",\"\",Interval!H9)","v":""},{"$f":"IF(Interval!C9<>\"\",Interval!I9,\"\")","v":""},{"$f":"IF(Interval!C9<>\"\",Interval!J9,\"\")","v":""},{"$f":"IF(Interval!K9<>\"\",Interval!K9,\"\")","v":""}]
[{"$f":"IF(Interval!B10<>\"\",Interval!B10,\"\")","v":""},{"$f":"IF(Interval!C10<>\"\",Interval!C10,\"\")","v":""},{"$f":"IF(Interval!D10<>\"\",Interval!D10,\"\")","v":""},{"$f":"IF(Interval!F10=0,\"\",Interval!F10)","v":""},{"$f":"IF(Interval!F10=\"\",\"\",Interval!G10)","v":""},{"$f":"IF(Interval!F10=\"\",\"\",Interval!H10)","v":""},{"$f":"IF(Interval!C10<>\"\",Interval!I10,\"\")","v":""},{"$f":"IF(Interval!C10<>\"\",Interval!J10,\"\")","v":""},{"$f":"IF(Interval!K10<>\"\",Interval!K10,\"\")","v":""}]
[{"$f":"IF(Interval!B11<>\"\",Interval!B11,\"\")","v":""},{"$f":"IF(Interval!C11<>\"\",Interval!C11,\"\")","v":""},{"$f":"IF(Interval!D11<>\"\",Interval!D11,\"\")","v":""},{"$f":"IF(Interval!F11=0,\"\",Interval!F11)","v":""},{"$f":"IF(Interval!F11=\"\",\"\",Interval!G11)","v":""},{"$f":"IF(Interval!F11=\"\",\"\",Interval!H11)","v":""},{"$f":"IF(Interval!C11<>\"\",Interval!I11,\"\")","v":""},{"$f":"IF(Interval!C11<>\"\",Interval!J11,\"\")","v":""},{"$f":"IF(Interval!K11<>\"\",Interval!K11,\"\")","v":""}]
[{"$f":"IF(Interval!B12<>\"\",Interval!B12,\"\")","v":""},{"$f":"IF(Interval!C12<>\"\",Interval!C12,\"\")","v":""},{"$f":"IF(Interval!D12<>\"\",Interval!D12,\"\")","v":""},{"$f":"IF(Interval!F12=0,\"\",Interval!F12)","v":""},{"$f":"IF(Interval!F12=\"\",\"\",Interval!G12)","v":""},{"$f":"IF(Interval!F12=\"\",\"\",Interval!H12)","v":""},{"$f":"IF(Interval!C12<>\"\",Interval!I12,\"\")","v":""},{"$f":"IF(Interval!C12<>\"\",Interval!J12,\"\")","v":""},{"$f":"IF(Interval!K12<>\"\",Interval!K12,\"\")","v":""}]
[{"$f":"IF(Interval!B13<>\"\",Interval!B13,\"\")","v":""},{"$f":"IF(Interval!C13<>\"\",Interval!C13,\"\")","v":""},{"$f":"IF(Interval!D13<>\"\",Interval!D13,\"\")","v":""},{"$f":"IF(Interval!F13=0,\"\",Interval!F13)","v":""},{"$f":"IF(Interval!F13=\"\",\"\",Interval!G13)","v":""},{"$f":"IF(Interval!F13=\"\",\"\",Interval!H13)","v":""},{"$f":"IF(Interval!C13<>\"\",Interval!I13,\"\")","v":""},{"$f":"IF(Interval!C13<>\"\",Interval!J13,\"\")","v":""},{"$f":"IF(Interval!K13<>\"\",Interval!K13,\"\")","v":""}]
[{"$f":"IF(Interval!B14<>\"\",Interval!B14,\"\")","v":""},{"$f":"IF(Interval!C14<>\"\",Interval!C14,\"\")","v":""},{"$f":"IF(Interval!D14<>\"\",Interval!D14,\"\")","v":""},{"$f":"IF(Interval!F14=0,\"\",Interval!F14)","v":""},{"$f":"IF(Interval!F14=\"\",\"\",Interval!G14)","v":""},{"$f":"IF(Interval!F14=\"\",\"\",Interval!H14)","v":""},{"$f":"IF(Interval!C14<>\"\",Interval!I14,\"\")","v":""},{"$f":"IF(Interval!C14<>\"\",Interval!J14,\"\")","v":""},{"$f":"IF(Interval!K14<>\"\",Interval!K14,\"\")","v":""}]
[{"$f":"IF(Interval!B15<>\"\",Interval!B15,\"\")","v":""},{"$f":"IF(Interval!C15<>\"\",Interval!C15,\"\")","v":""},{"$f":"IF(Interval!D15<>\"\",Interval!D15,\"\")","v":""},{"$f":"IF(Interval!F15=0,\"\",Interval!F15)","v":""},{"$f":"IF(Interval!F15=\"\",\"\",Interval!G15)","v":""},{"$f":"IF(Interval!F15=\"\",\"\",Interval!H15)","v":""},{"$f":"IF(Interval!C15<>\"\",Interval!I15,\"\")","v":""},{"$f":"IF(Interval!C15<>\"\",Interval!J15,\"\")","v":""},{"$f":"IF(Interval!K15<>\"\",Interval!K15,\"\")","v":""}]
[{"$f":"IF(Interval!B16<>\"\",Interval!B16,\"\")","v":""},{"$f":"IF(Interval!C16<>\"\",Interval!C16,\"\")","v":""},{"$f":"IF(Interval!D16<>\"\",Interval!D16,\"\")","v":""},{"$f":"IF(Interval!F16=0,\"\",Interval!F16)","v":""},{"$f":"IF(Interval!F16=\"\",\"\",Interval!G16)","v":""},{"$f":"IF(Interval!F16=\"\",\"\",Interval!H16)","v":""},{"$f":"IF(Interval!C16<>\"\",Interval!I16,\"\")","v":""},{"$f":"IF(Interval!C16<>\"\",Interval!J16,\"\")","v":""},{"$f":"IF(Interval!K16<>\"\",Interval!K16,\"\")","v":""}]
[{"$f":"IF(Interval!B17<>\"\",Interval!B17,\"\")","v":""},{"$f":"IF(Interval!C17<>\"\",Interval!C17,\"\")","v":""},{"$f":"IF(Interval!D17<>\"\",Interval!D17,\"\")","v":""},{"$f":"IF(Interval!F17=0,\"\",Interval!F17)","v":""},{"$f":"IF(Interval!F17=\"\",\"\",Interval!G17)","v":""},{"$f":"IF(Interval!F17=\"\",\"\",Interval!H17)","v":""},{"$f":"IF(Interval!C17<>\"\",Interval!I17,\"\")","v":""},{"$f":"IF(Interval!C17<>\"\",Interval!J17,\"\")","v":""},{"$f":"IF(Interval!K17<>\"\",Interval!K17,\"\")","v":""}]
[{"$f":"IF(Interval!B18<>\"\",Interval!B18,\"\")","v":""},{"$f":"IF(Interval!C18<>\"\",Interval!C18,\"\")","v":""},{"$f":"IF(Interval!D18<>\"\",Interval!D18,\"\")","v":""},{"$f":"IF(Interval!F18=0,\"\",Interval!F18)","v":""},{"$f":"IF(Interval!F18=\"\",\"\",Interval!G18)","v":""},{"$f":"IF(Interval!F18=\"\",\"\",Interval!H18)","v":""},{"$f":"IF(Interval!C18<>\"\",Interval!I18,\"\")","v":""},{"$f":"IF(Interval!C18<>\"\",Interval!J18,\"\")","v":""},{"$f":"IF(Interval!K18<>\"\",Interval!K18,\"\")","v":""}]
[]
[]
[]
[]
[]
[]
[]
[]
[]
[]
[]
[]
[]
[{"$f":"A33","v":0},{"$f":"B33","v":"2023-09-22T15:35:42.090"},null,null,null,null,null,{"$f":"H33","v":0},null,null,{"$f":"K33","v":0}]
[]
[null,null,null,null,null,null,null,null,null,null,{"$f":"Dierenarts!P1","v":"TOTAAL"}]
[{"$f":"Dierenarts!B2","v":"Diergeneeskundig verslag"},null,null,null,null,{"$f":"Dierenarts!I3","v":"Tab Dierenarts pas invullen vanaf datum IBN 01/06/2023"},null,null,null,null,{"$f":"Dierenarts!P2","v":0}]
[{"$f":"Dierenarts!B3","v":"Dierenarts"},{"$f":"Dierenarts!C3","v":"Datum"},{"$f":"Dierenarts!D3","v":"Aantal dieren"},{"$f":"Dierenarts!E3","v":"EUR"}]
[{"$f":"Dierenarts!B4","v":0},{"$f":"Dierenarts!C4","v":"00:00:00"},{"$f":"Dierenarts!D4","v":0},{"$f":"Dierenarts!E4","v":0}]
[{"$f":"Dierenarts!B5","v":0},{"$f":"Dierenarts!C5","v":"00:00:00"},{"$f":"Dierenarts!D5","v":0},{"$f":"Dierenarts!E5","v":0}]
[{"$f":"Dierenarts!B6","v":0},{"$f":"Dierenarts!C6","v":"00:00:00"},{"$f":"Dierenarts!D6","v":0},{"$f":"Dierenarts!E6","v":0}]
[{"$f":"Dierenarts!B7","v":0},{"$f":"Dierenarts!C7","v":"00:00:00"},{"$f":"Dierenarts!D7","v":0},{"$f":"Dierenarts!E7","v":0}]
[]
[{"$f":"Dierenarts!B9","v":"Dierenartskosten"},null,{"$f":"Dierenarts!D9","v":""},null,null,null,null,null,null,null,{"$f":"Dierenarts!P9","v":0}]
[{"$f":"Dierenarts!B10","v":"Naam/\nomschrijving"},{"$f":"Dierenarts!C10","v":"Diersoort"},{"$f":"Dierenarts!D10","v":"Identificatie-nummer"},{"$f":"Dierenarts!E10","v":"Geslacht (enkel bij Kat)"},{"$f":"Dierenarts!F10","v":"Identificeren"},{"$f":"Dierenarts!H10","v":"Registreren"},{"$f":"Dierenarts!J10","v":"Paspoort"},{"$f":"Dierenarts!L10","v":"Vaccinatie"},{"$f":"Dierenarts!N10","v":"Sterilisatie/\ncastratie"},null,{"$f":"Dierenarts!P10","v":"Totaal"}]
[{"$f":"IF(Dierenarts!B11<>\"\",Dierenarts!B11,\"\")","v":""},{"$f":"IF(Dierenarts!C11<>\"\",Dierenarts!C11,\"\")","v":""},{"$f":"IF(Dierenarts!D11<>\"\",Dierenarts!D11,\"\")","v":""},{"$f":"IF(Dierenarts!E11<>\"\",Dierenarts!E11,\"\")","v":""},{"$f":"IF(Dierenarts!F11<>\"\",Dierenarts!F11,\"\")","v":""},{"$f":"IF(Dierenarts!H11<>\"\",Dierenarts!H11,\"\")","v":""},{"$f":"IF(Dierenarts!J11<>\"\",Dierenarts!J11,\"\")","v":""},{"$f":"IF(Dierenarts!L11<>\"\",Dierenarts!L11,\"\")","v":""},{"$f":"IF(Dierenarts!N11<>\"\",Dierenarts!N11,\"\")","v":""},null,{"$f":"IF(Dierenarts!P11<>\"\",Dierenarts!P11,\"\")","v":0}]
[{"$f":"IF(Dierenarts!B12<>\"\",Dierenarts!B12,\"\")","v":""},{"$f":"IF(Dierenarts!C12<>\"\",Dierenarts!C12,\"\")","v":""},{"$f":"IF(Dierenarts!D12<>\"\",Dierenarts!D12,\"\")","v":""},{"$f":"IF(Dierenarts!E12<>\"\",Dierenarts!E12,\"\")","v":""},{"$f":"IF(Dierenarts!F12<>\"\",Dierenarts!F12,\"\")","v":""},{"$f":"IF(Dierenarts!H12<>\"\",Dierenarts!H12,\"\")","v":""},{"$f":"IF(Dierenarts!J12<>\"\",Dierenarts!J12,\"\")","v":""},{"$f":"IF(Dierenarts!L12<>\"\",Dierenarts!L12,\"\")","v":""},{"$f":"IF(Dierenarts!N12<>\"\",Dierenarts!N12,\"\")","v":""},null,{"$f":"IF(Dierenarts!P12<>\"\",Dierenarts!P12,\"\")","v":0}]
[{"$f":"IF(Dierenarts!B13<>\"\",Dierenarts!B13,\"\")","v":""},{"$f":"IF(Dierenarts!C13<>\"\",Dierenarts!C13,\"\")","v":""},{"$f":"IF(Dierenarts!D13<>\"\",Dierenarts!D13,\"\")","v":""},{"$f":"IF(Dierenarts!E13<>\"\",Dierenarts!E13,\"\")","v":""},{"$f":"IF(Dierenarts!F13<>\"\",Dierenarts!F13,\"\")","v":""},{"$f":"IF(Dierenarts!H13<>\"\",Dierenarts!H13,\"\")","v":""},{"$f":"IF(Dierenarts!J13<>\"\",Dierenarts!J13,\"\")","v":""},{"$f":"IF(Dierenarts!L13<>\"\",Dierenarts!L13,\"\")","v":""},{"$f":"IF(Dierenarts!N13<>\"\",Dierenarts!N13,\"\")","v":""},null,{"$f":"IF(Dierenarts!P13<>\"\",Dierenarts!P13,\"\")","v":0}]
[{"$f":"IF(Dierenarts!B14<>\"\",Dierenarts!B14,\"\")","v":""},{"$f":"IF(Dierenarts!C14<>\"\",Dierenarts!C14,\"\")","v":""},{"$f":"IF(Dierenarts!D14<>\"\",Dierenarts!D14,\"\")","v":""},{"$f":"IF(Dierenarts!E14<>\"\",Dierenarts!E14,\"\")","v":""},{"$f":"IF(Dierenarts!F14<>\"\",Dierenarts!F14,\"\")","v":""},{"$f":"IF(Dierenarts!H14<>\"\",Dierenarts!H14,\"\")","v":""},{"$f":"IF(Dierenarts!J14<>\"\",Dierenarts!J14,\"\")","v":""},{"$f":"IF(Dierenarts!L14<>\"\",Dierenarts!L14,\"\")","v":""},{"$f":"IF(Dierenarts!N14<>\"\",Dierenarts!N14,\"\")","v":""},null,{"$f":"IF(Dierenarts!P14<>\"\",Dierenarts!P14,\"\")","v":0}]
[{"$f":"IF(Dierenarts!B15<>\"\",Dierenarts!B15,\"\")","v":""},{"$f":"IF(Dierenarts!C15<>\"\",Dierenarts!C15,\"\")","v":""},{"$f":"IF(Dierenarts!D15<>\"\",Dierenarts!D15,\"\")","v":""},{"$f":"IF(Dierenarts!E15<>\"\",Dierenarts!E15,\"\")","v":""},{"$f":"IF(Dierenarts!F15<>\"\",Dierenarts!F15,\"\")","v":""},{"$f":"IF(Dierenarts!H15<>\"\",Dierenarts!H15,\"\")","v":""},{"$f":"IF(Dierenarts!J15<>\"\",Dierenarts!J15,\"\")","v":""},{"$f":"IF(Dierenarts!L15<>\"\",Dierenarts!L15,\"\")","v":""},{"$f":"IF(Dierenarts!N15<>\"\",Dierenarts!N15,\"\")","v":""},null,{"$f":"IF(Dierenarts!P15<>\"\",Dierenarts!P15,\"\")","v":0}]
[{"$f":"IF(Dierenarts!B16<>\"\",Dierenarts!B16,\"\")","v":""},{"$f":"IF(Dierenarts!C16<>\"\",Dierenarts!C16,\"\")","v":""},{"$f":"IF(Dierenarts!D16<>\"\",Dierenarts!D16,\"\")","v":""},{"$f":"IF(Dierenarts!E16<>\"\",Dierenarts!E16,\"\")","v":""},{"$f":"IF(Dierenarts!F16<>\"\",Dierenarts!F16,\"\")","v":""},{"$f":"IF(Dierenarts!H16<>\"\",Dierenarts!H16,\"\")","v":""},{"$f":"IF(Dierenarts!J16<>\"\",Dierenarts!J16,\"\")","v":""},{"$f":"IF(Dierenarts!L16<>\"\",Dierenarts!L16,\"\")","v":""},{"$f":"IF(Dierenarts!N16<>\"\",Dierenarts!N16,\"\")","v":""},null,{"$f":"IF(Dierenarts!P16<>\"\",Dierenarts!P16,\"\")","v":0}]
[{"$f":"IF(Dierenarts!B17<>\"\",Dierenarts!B17,\"\")","v":""},{"$f":"IF(Dierenarts!C17<>\"\",Dierenarts!C17,\"\")","v":""},{"$f":"IF(Dierenarts!D17<>\"\",Dierenarts!D17,\"\")","v":""},{"$f":"IF(Dierenarts!E17<>\"\",Dierenarts!E17,\"\")","v":""},{"$f":"IF(Dierenarts!F17<>\"\",Dierenarts!F17,\"\")","v":""},{"$f":"IF(Dierenarts!H17<>\"\",Dierenarts!H17,\"\")","v":""},{"$f":"IF(Dierenarts!J17<>\"\",Dierenarts!J17,\"\")","v":""},{"$f":"IF(Dierenarts!L17<>\"\",Dierenarts!L17,\"\")","v":""},{"$f":"IF(Dierenarts!N17<>\"\",Dierenarts!N17,\"\")","v":""},null,{"$f":"IF(Dierenarts!P17<>\"\",Dierenarts!P17,\"\")","v":0}]
[{"$f":"IF(Dierenarts!B18<>\"\",Dierenarts!B18,\"\")","v":""},{"$f":"IF(Dierenarts!C18<>\"\",Dierenarts!C18,\"\")","v":""},{"$f":"IF(Dierenarts!D18<>\"\",Dierenarts!D18,\"\")","v":""},{"$f":"IF(Dierenarts!E18<>\"\",Dierenarts!E18,\"\")","v":""},{"$f":"IF(Dierenarts!F18<>\"\",Dierenarts!F18,\"\")","v":""},{"$f":"IF(Dierenarts!H18<>\"\",Dierenarts!H18,\"\")","v":""},{"$f":"IF(Dierenarts!J18<>\"\",Dierenarts!J18,\"\")","v":""},{"$f":"IF(Dierenarts!L18<>\"\",Dierenarts!L18,\"\")","v":""},{"$f":"IF(Dierenarts!N18<>\"\",Dierenarts!N18,\"\")","v":""},null,{"$f":"IF(Dierenarts!P18<>\"\",Dierenarts!P18,\"\")","v":0}]
[{"$f":"IF(Dierenarts!B19<>\"\",Dierenarts!B19,\"\")","v":""},{"$f":"IF(Dierenarts!C19<>\"\",Dierenarts!C19,\"\")","v":""},{"$f":"IF(Dierenarts!D19<>\"\",Dierenarts!D19,\"\")","v":""},{"$f":"IF(Dierenarts!E19<>\"\",Dierenarts!E19,\"\")","v":""},{"$f":"IF(Dierenarts!F19<>\"\",Dierenarts!F19,\"\")","v":""},{"$f":"IF(Dierenarts!H19<>\"\",Dierenarts!H19,\"\")","v":""},{"$f":"IF(Dierenarts!J19<>\"\",Dierenarts!J19,\"\")","v":""},{"$f":"IF(Dierenarts!L19<>\"\",Dierenarts!L19,\"\")","v":""},{"$f":"IF(Dierenarts!N19<>\"\",Dierenarts!N19,\"\")","v":""},null,{"$f":"IF(Dierenarts!P19<>\"\",Dierenarts!P19,\"\")","v":0}]
[{"$f":"IF(Dierenarts!B20<>\"\",Dierenarts!B20,\"\")","v":""},{"$f":"IF(Dierenarts!C20<>\"\",Dierenarts!C20,\"\")","v":""},{"$f":"IF(Dierenarts!D20<>\"\",Dierenarts!D20,\"\")","v":""},{"$f":"IF(Dierenarts!E20<>\"\",Dierenarts!E20,\"\")","v":""},{"$f":"IF(Dierenarts!F20<>\"\",Dierenarts!F20,\"\")","v":""},{"$f":"IF(Dierenarts!H20<>\"\",Dierenarts!H20,\"\")","v":""},{"$f":"IF(Dierenarts!J20<>\"\",Dierenarts!J20,\"\")","v":""},{"$f":"IF(Dierenarts!L20<>\"\",Dierenarts!L20,\"\")","v":""},{"$f":"IF(Dierenarts!N20<>\"\",Dierenarts!N20,\"\")","v":""},null,{"$f":"IF(Dierenarts!P20<>\"\",Dierenarts!P20,\"\")","v":0}]
[{"$f":"IF(Dierenarts!B21<>\"\",Dierenarts!B21,\"\")","v":""},{"$f":"IF(Dierenarts!C21<>\"\",Dierenarts!C21,\"\")","v":""},{"$f":"IF(Dierenarts!D21<>\"\",Dierenarts!D21,\"\")","v":""},{"$f":"IF(Dierenarts!E21<>\"\",Dierenarts!E21,\"\")","v":""},{"$f":"IF(Dierenarts!F21<>\"\",Dierenarts!F21,\"\")","v":""},{"$f":"IF(Dierenarts!H21<>\"\",Dierenarts!H21,\"\")","v":""},{"$f":"IF(Dierenarts!J21<>\"\",Dierenarts!J21,\"\")","v":""},{"$f":"IF(Dierenarts!L21<>\"\",Dierenarts!L21,\"\")","v":""},{"$f":"IF(Dierenarts!N21<>\"\",Dierenarts!N21,\"\")","v":""},null,{"$f":"IF(Dierenarts!P21<>\"\",Dierenarts!P21,\"\")","v":0}]
[{"$f":"IF(Dierenarts!B22<>\"\",Dierenarts!B22,\"\")","v":""},{"$f":"IF(Dierenarts!C22<>\"\",Dierenarts!C22,\"\")","v":""},{"$f":"IF(Dierenarts!D22<>\"\",Dierenarts!D22,\"\")","v":""},{"$f":"IF(Dierenarts!E22<>\"\",Dierenarts!E22,\"\")","v":""},{"$f":"IF(Dierenarts!F22<>\"\",Dierenarts!F22,\"\")","v":""},{"$f":"IF(Dierenarts!H22<>\"\",Dierenarts!H22,\"\")","v":""},{"$f":"IF(Dierenarts!J22<>\"\",Dierenarts!J22,\"\")","v":""},{"$f":"IF(Dierenarts!L22<>\"\",Dierenarts!L22,\"\")","v":""},{"$f":"IF(Dierenarts!N22<>\"\",Dierenarts!N22,\"\")","v":""},null,{"$f":"IF(Dierenarts!P22<>\"\",Dierenarts!P22,\"\")","v":0}]
[{"$f":"IF(Dierenarts!B23<>\"\",Dierenarts!B23,\"\")","v":""},{"$f":"IF(Dierenarts!C23<>\"\",Dierenarts!C23,\"\")","v":""},{"$f":"IF(Dierenarts!D23<>\"\",Dierenarts!D23,\"\")","v":""},{"$f":"IF(Dierenarts!E23<>\"\",Dierenarts!E23,\"\")","v":""},{"$f":"IF(Dierenarts!F23<>\"\",Dierenarts!F23,\"\")","v":""},{"$f":"IF(Dierenarts!H23<>\"\",Dierenarts!H23,\"\")","v":""},{"$f":"IF(Dierenarts!J23<>\"\",Dierenarts!J23,\"\")","v":""},{"$f":"IF(Dierenarts!L23<>\"\",Dierenarts!L23,\"\")","v":""},{"$f":"IF(Dierenarts!N23<>\"\",Dierenarts!N23,\"\")","v":""},null,{"$f":"IF(Dierenarts!P23<>\"\",Dierenarts!P23,\"\")","v":0}]
[{"$f":"IF(Dierenarts!B24<>\"\",Dierenarts!B24,\"\")","v":""},{"$f":"IF(Dierenarts!C24<>\"\",Dierenarts!C24,\"\")","v":""},{"$f":"IF(Dierenarts!D24<>\"\",Dierenarts!D24,\"\")","v":""},{"$f":"IF(Dierenarts!E24<>\"\",Dierenarts!E24,\"\")","v":""},{"$f":"IF(Dierenarts!F24<>\"\",Dierenarts!F24,\"\")","v":""},{"$f":"IF(Dierenarts!H24<>\"\",Dierenarts!H24,\"\")","v":""},{"$f":"IF(Dierenarts!J24<>\"\",Dierenarts!J24,\"\")","v":""},{"$f":"IF(Dierenarts!L24<>\"\",Dierenarts!L24,\"\")","v":""},{"$f":"IF(Dierenarts!N24<>\"\",Dierenarts!N24,\"\")","v":""},null,{"$f":"IF(Dierenarts!P24<>\"\",Dierenarts!P24,\"\")","v":0}]
[{"$f":"IF(Dierenarts!B25<>\"\",Dierenarts!B25,\"\")","v":""},{"$f":"IF(Dierenarts!C25<>\"\",Dierenarts!C25,\"\")","v":""},{"$f":"IF(Dierenarts!D25<>\"\",Dierenarts!D25,\"\")","v":""},{"$f":"IF(Dierenarts!E25<>\"\",Dierenarts!E25,\"\")","v":""},{"$f":"IF(Dierenarts!F25<>\"\",Dierenarts!F25,\"\")","v":""},{"$f":"IF(Dierenarts!H25<>\"\",Dierenarts!H25,\"\")","v":""},{"$f":"IF(Dierenarts!J25<>\"\",Dierenarts!J25,\"\")","v":""},{"$f":"IF(Dierenarts!L25<>\"\",Dierenarts!L25,\"\")","v":""},{"$f":"IF(Dierenarts!N25<>\"\",Dierenarts!N25,\"\")","v":""},null,{"$f":"IF(Dierenarts!P25<>\"\",Dierenarts!P25,\"\")","v":0}]
[{"$f":"IF(Dierenarts!B26<>\"\",Dierenarts!B26,\"\")","v":""},{"$f":"IF(Dierenarts!C26<>\"\",Dierenarts!C26,\"\")","v":""},{"$f":"IF(Dierenarts!D26<>\"\",Dierenarts!D26,\"\")","v":""},{"$f":"IF(Dierenarts!E26<>\"\",Dierenarts!E26,\"\")","v":""},{"$f":"IF(Dierenarts!F26<>\"\",Dierenarts!F26,\"\")","v":""},{"$f":"IF(Dierenarts!H26<>\"\",Dierenarts!H26,\"\")","v":""},{"$f":"IF(Dierenarts!J26<>\"\",Dierenarts!J26,\"\")","v":""},{"$f":"IF(Dierenarts!L26<>\"\",Dierenarts!L26,\"\")","v":""},{"$f":"IF(Dierenarts!N26<>\"\",Dierenarts!N26,\"\")","v":""},null,{"$f":"IF(Dierenarts!P26<>\"\",Dierenarts!P26,\"\")","v":0}]
[{"$f":"IF(Dierenarts!B27<>\"\",Dierenarts!B27,\"\")","v":""},{"$f":"IF(Dierenarts!C27<>\"\",Dierenarts!C27,\"\")","v":""},{"$f":"IF(Dierenarts!D27<>\"\",Dierenarts!D27,\"\")","v":""},{"$f":"IF(Dierenarts!E27<>\"\",Dierenarts!E27,\"\")","v":""},{"$f":"IF(Dierenarts!F27<>\"\",Dierenarts!F27,\"\")","v":""},{"$f":"IF(Dierenarts!H27<>\"\",Dierenarts!H27,\"\")","v":""},{"$f":"IF(Dierenarts!J27<>\"\",Dierenarts!J27,\"\")","v":""},{"$f":"IF(Dierenarts!L27<>\"\",Dierenarts!L27,\"\")","v":""},{"$f":"IF(Dierenarts!N27<>\"\",Dierenarts!N27,\"\")","v":""},null,{"$f":"IF(Dierenarts!P27<>\"\",Dierenarts!P27,\"\")","v":0}]
[{"$f":"IF(Dierenarts!B28<>\"\",Dierenarts!B28,\"\")","v":""},{"$f":"IF(Dierenarts!C28<>\"\",Dierenarts!C28,\"\")","v":""},{"$f":"IF(Dierenarts!D28<>\"\",Dierenarts!D28,\"\")","v":""},{"$f":"IF(Dierenarts!E28<>\"\",Dierenarts!E28,\"\")","v":""},{"$f":"IF(Dierenarts!F28<>\"\",Dierenarts!F28,\"\")","v":""},{"$f":"IF(Dierenarts!H28<>\"\",Dierenarts!H28,\"\")","v":""},{"$f":"IF(Dierenarts!J28<>\"\",Dierenarts!J28,\"\")","v":""},{"$f":"IF(Dierenarts!L28<>\"\",Dierenarts!L28,\"\")","v":""},{"$f":"IF(Dierenarts!N28<>\"\",Dierenarts!N28,\"\")","v":""},null,{"$f":"IF(Dierenarts!P28<>\"\",Dierenarts!P28,\"\")","v":0}]
[{"$f":"IF(Dierenarts!B29<>\"\",Dierenarts!B29,\"\")","v":""},{"$f":"IF(Dierenarts!C29<>\"\",Dierenarts!C29,\"\")","v":""},{"$f":"IF(Dierenarts!D29<>\"\",Dierenarts!D29,\"\")","v":""},{"$f":"IF(Dierenarts!E29<>\"\",Dierenarts!E29,\"\")","v":""},{"$f":"IF(Dierenarts!F29<>\"\",Dierenarts!F29,\"\")","v":""},{"$f":"IF(Dierenarts!H29<>\"\",Dierenarts!H29,\"\")","v":""},{"$f":"IF(Dierenarts!J29<>\"\",Dierenarts!J29,\"\")","v":""},{"$f":"IF(Dierenarts!L29<>\"\",Dierenarts!L29,\"\")","v":""},{"$f":"IF(Dierenarts!N29<>\"\",Dierenarts!N29,\"\")","v":""},null,{"$f":"IF(Dierenarts!P29<>\"\",Dierenarts!P29,\"\")","v":0}]
[{"$f":"IF(Dierenarts!B30<>\"\",Dierenarts!B30,\"\")","v":""},{"$f":"IF(Dierenarts!C30<>\"\",Dierenarts!C30,\"\")","v":""},{"$f":"IF(Dierenarts!D30<>\"\",Dierenarts!D30,\"\")","v":""},{"$f":"IF(Dierenarts!E30<>\"\",Dierenarts!E30,\"\")","v":""},{"$f":"IF(Dierenarts!F30<>\"\",Dierenarts!F30,\"\")","v":""},{"$f":"IF(Dierenarts!H30<>\"\",Dierenarts!H30,\"\")","v":""},{"$f":"IF(Dierenarts!J30<>\"\",Dierenarts!J30,\"\")","v":""},{"$f":"IF(Dierenarts!L30<>\"\",Dierenarts!L30,\"\")","v":""},{"$f":"IF(Dierenarts!N30<>\"\",Dierenarts!N30,\"\")","v":""},null,{"$f":"IF(Dierenarts!P30<>\"\",Dierenarts!P30,\"\")","v":0}]
[{"$f":"IF(Dierenarts!B31<>\"\",Dierenarts!B31,\"\")","v":""},{"$f":"IF(Dierenarts!C31<>\"\",Dierenarts!C31,\"\")","v":""},{"$f":"IF(Dierenarts!D31<>\"\",Dierenarts!D31,\"\")","v":""},{"$f":"IF(Dierenarts!E31<>\"\",Dierenarts!E31,\"\")","v":""},{"$f":"IF(Dierenarts!F31<>\"\",Dierenarts!F31,\"\")","v":""},{"$f":"IF(Dierenarts!H31<>\"\",Dierenarts!H31,\"\")","v":""},{"$f":"IF(Dierenarts!J31<>\"\",Dierenarts!J31,\"\")","v":""},{"$f":"IF(Dierenarts!L31<>\"\",Dierenarts!L31,\"\")","v":""},{"$f":"IF(Dierenarts!N31<>\"\",Dierenarts!N31,\"\")","v":""},null,{"$f":"IF(Dierenarts!P31<>\"\",Dierenarts!P31,\"\")","v":0}]
[{"$f":"IF(Dierenarts!B32<>\"\",Dierenarts!B32,\"\")","v":""},{"$f":"IF(Dierenarts!C32<>\"\",Dierenarts!C32,\"\")","v":""},{"$f":"IF(Dierenarts!D32<>\"\",Dierenarts!D32,\"\")","v":""},{"$f":"IF(Dierenarts!E32<>\"\",Dierenarts!E32,\"\")","v":""},{"$f":"IF(Dierenarts!F32<>\"\",Dierenarts!F32,\"\")","v":""},{"$f":"IF(Dierenarts!H32<>\"\",Dierenarts!H32,\"\")","v":""},{"$f":"IF(Dierenarts!J32<>\"\",Dierenarts!J32,\"\")","v":""},{"$f":"IF(Dierenarts!L32<>\"\",Dierenarts!L32,\"\")","v":""},{"$f":"IF(Dierenarts!N32<>\"\",Dierenarts!N32,\"\")","v":""},null,{"$f":"IF(Dierenarts!P32<>\"\",Dierenarts!P32,\"\")","v":0}]
[{"$f":"IF(Dierenarts!B33<>\"\",Dierenarts!B33,\"\")","v":""},{"$f":"IF(Dierenarts!C33<>\"\",Dierenarts!C33,\"\")","v":""},{"$f":"IF(Dierenarts!D33<>\"\",Dierenarts!D33,\"\")","v":""},{"$f":"IF(Dierenarts!E33<>\"\",Dierenarts!E33,\"\")","v":""},{"$f":"IF(Dierenarts!F33<>\"\",Dierenarts!F33,\"\")","v":""},{"$f":"IF(Dierenarts!H33<>\"\",Dierenarts!H33,\"\")","v":""},{"$f":"IF(Dierenarts!J33<>\"\",Dierenarts!J33,\"\")","v":""},{"$f":"IF(Dierenarts!L33<>\"\",Dierenarts!L33,\"\")","v":""},{"$f":"IF(Dierenarts!N33<>\"\",Dierenarts!N33,\"\")","v":""},null,{"$f":"IF(Dierenarts!P33<>\"\",Dierenarts!P33,\"\")","v":0}]
[{"$f":"IF(Dierenarts!B34<>\"\",Dierenarts!B34,\"\")","v":""},{"$f":"IF(Dierenarts!C34<>\"\",Dierenarts!C34,\"\")","v":""},{"$f":"IF(Dierenarts!D34<>\"\",Dierenarts!D34,\"\")","v":""},{"$f":"IF(Dierenarts!E34<>\"\",Dierenarts!E34,\"\")","v":""},{"$f":"IF(Dierenarts!F34<>\"\",Dierenarts!F34,\"\")","v":""},{"$f":"IF(Dierenarts!H34<>\"\",Dierenarts!H34,\"\")","v":""},{"$f":"IF(Dierenarts!J34<>\"\",Dierenarts!J34,\"\")","v":""},{"$f":"IF(Dierenarts!L34<>\"\",Dierenarts!L34,\"\")","v":""},{"$f":"IF(Dierenarts!N34<>\"\",Dierenarts!N34,\"\")","v":""},null,{"$f":"IF(Dierenarts!P34<>\"\",Dierenarts!P34,\"\")","v":0}]
[{"$f":"IF(Dierenarts!B35<>\"\",Dierenarts!B35,\"\")","v":""},{"$f":"IF(Dierenarts!C35<>\"\",Dierenarts!C35,\"\")","v":""},{"$f":"IF(Dierenarts!D35<>\"\",Dierenarts!D35,\"\")","v":""},{"$f":"IF(Dierenarts!E35<>\"\",Dierenarts!E35,\"\")","v":""},{"$f":"IF(Dierenarts!F35<>\"\",Dierenarts!F35,\"\")","v":""},{"$f":"IF(Dierenarts!H35<>\"\",Dierenarts!H35,\"\")","v":""},{"$f":"IF(Dierenarts!J35<>\"\",Dierenarts!J35,\"\")","v":""},{"$f":"IF(Dierenarts!L35<>\"\",Dierenarts!L35,\"\")","v":""},{"$f":"IF(Dierenarts!N35<>\"\",Dierenarts!N35,\"\")","v":""},null,{"$f":"IF(Dierenarts!P35<>\"\",Dierenarts!P35,\"\")","v":0}]
[{"$f":"IF(Dierenarts!B36<>\"\",Dierenarts!B36,\"\")","v":""},{"$f":"IF(Dierenarts!C36<>\"\",Dierenarts!C36,\"\")","v":""},{"$f":"IF(Dierenarts!D36<>\"\",Dierenarts!D36,\"\")","v":""},{"$f":"IF(Dierenarts!E36<>\"\",Dierenarts!E36,\"\")","v":""},{"$f":"IF(Dierenarts!F36<>\"\",Dierenarts!F36,\"\")","v":""},{"$f":"IF(Dierenarts!H36<>\"\",Dierenarts!H36,\"\")","v":""},{"$f":"IF(Dierenarts!J36<>\"\",Dierenarts!J36,\"\")","v":""},{"$f":"IF(Dierenarts!L36<>\"\",Dierenarts!L36,\"\")","v":""},{"$f":"IF(Dierenarts!N36<>\"\",Dierenarts!N36,\"\")","v":""},null,{"$f":"IF(Dierenarts!P36<>\"\",Dierenarts!P36,\"\")","v":0}]
[{"$f":"IF(Dierenarts!B37<>\"\",Dierenarts!B37,\"\")","v":""},{"$f":"IF(Dierenarts!C37<>\"\",Dierenarts!C37,\"\")","v":""},{"$f":"IF(Dierenarts!D37<>\"\",Dierenarts!D37,\"\")","v":""},{"$f":"IF(Dierenarts!E37<>\"\",Dierenarts!E37,\"\")","v":""},{"$f":"IF(Dierenarts!F37<>\"\",Dierenarts!F37,\"\")","v":""},{"$f":"IF(Dierenarts!H37<>\"\",Dierenarts!H37,\"\")","v":""},{"$f":"IF(Dierenarts!J37<>\"\",Dierenarts!J37,\"\")","v":""},{"$f":"IF(Dierenarts!L37<>\"\",Dierenarts!L37,\"\")","v":""},{"$f":"IF(Dierenarts!N37<>\"\",Dierenarts!N37,\"\")","v":""},null,{"$f":"IF(Dierenarts!P37<>\"\",Dierenarts!P37,\"\")","v":0}]
[{"$f":"IF(Dierenarts!B38<>\"\",Dierenarts!B38,\"\")","v":""},{"$f":"IF(Dierenarts!C38<>\"\",Dierenarts!C38,\"\")","v":""},{"$f":"IF(Dierenarts!D38<>\"\",Dierenarts!D38,\"\")","v":""},{"$f":"IF(Dierenarts!E38<>\"\",Dierenarts!E38,\"\")","v":""},{"$f":"IF(Dierenarts!F38<>\"\",Dierenarts!F38,\"\")","v":""},{"$f":"IF(Dierenarts!H38<>\"\",Dierenarts!H38,\"\")","v":""},{"$f":"IF(Dierenarts!J38<>\"\",Dierenarts!J38,\"\")","v":""},{"$f":"IF(Dierenarts!L38<>\"\",Dierenarts!L38,\"\")","v":""},{"$f":"IF(Dierenarts!N38<>\"\",Dierenarts!N38,\"\")","v":""},null,{"$f":"IF(Dierenarts!P38<>\"\",Dierenarts!P38,\"\")","v":0}]
[{"$f":"IF(Dierenarts!B39<>\"\",Dierenarts!B39,\"\")","v":""},{"$f":"IF(Dierenarts!C39<>\"\",Dierenarts!C39,\"\")","v":""},{"$f":"IF(Dierenarts!D39<>\"\",Dierenarts!D39,\"\")","v":""},{"$f":"IF(Dierenarts!E39<>\"\",Dierenarts!E39,\"\")","v":""},{"$f":"IF(Dierenarts!F39<>\"\",Dierenarts!F39,\"\")","v":""},{"$f":"IF(Dierenarts!H39<>\"\",Dierenarts!H39,\"\")","v":""},{"$f":"IF(Dierenarts!J39<>\"\",Dierenarts!J39,\"\")","v":""},{"$f":"IF(Dierenarts!L39<>\"\",Dierenarts!L39,\"\")","v":""},{"$f":"IF(Dierenarts!N39<>\"\",Dierenarts!N39,\"\")","v":""},null,{"$f":"IF(Dierenarts!P39<>\"\",Dierenarts!P39,\"\")","v":0}]
[{"$f":"IF(Dierenarts!B40<>\"\",Dierenarts!B40,\"\")","v":""},{"$f":"IF(Dierenarts!C40<>\"\",Dierenarts!C40,\"\")","v":""},{"$f":"IF(Dierenarts!D40<>\"\",Dierenarts!D40,\"\")","v":""},{"$f":"IF(Dierenarts!E40<>\"\",Dierenarts!E40,\"\")","v":""},{"$f":"IF(Dierenarts!F40<>\"\",Dierenarts!F40,\"\")","v":""},{"$f":"IF(Dierenarts!H40<>\"\",Dierenarts!H40,\"\")","v":""},{"$f":"IF(Dierenarts!J40<>\"\",Dierenarts!J40,\"\")","v":""},{"$f":"IF(Dierenarts!L40<>\"\",Dierenarts!L40,\"\")","v":""},{"$f":"IF(Dierenarts!N40<>\"\",Dierenarts!N40,\"\")","v":""},null,{"$f":"IF(Dierenarts!P40<>\"\",Dierenarts!P40,\"\")","v":0}]
[]
[{"$f":"A63","v":0},{"$f":"NOW()","v":"2023-09-22T15:35:42.090"},null,null,null,null,null,{"$f":"H63","v":0},null,null,{"$f":"K63","v":0}]

{"sheet":"Prices","index":7,"n_rows":553,"n_cols":14,"rows_kept":553,"cut":false,"hidden":true,"merged":[]}
["nr","combo hierop sorteren",null,"Category","Name","van","tot","prijs",null,null,null,null,null,"Uitheems"]
[510,{"$f":"D2&E2&TEXT(F2,\"0000\")","v":"InheemsAmfibieën0001"},{"$f":"H2","v":3.15},"Inheems","Amfibieën",1,5,3.15,{"$f":"D2&E2","v":"InheemsAmfibieën"}]
[511,"InheemsAmfibieën0006",9.4499999999999993,"Inheems","Amfibieën",6,15,9.4499999999999993,"InheemsAmfibieën"]
[512,"InheemsAmfibieën0016",22.05,"Inheems","Amfibieën",16,35,22.05,"InheemsAmfibieën"]
[513,"InheemsAmfibieën0036",34.65,"Inheems","Amfibieën",36,55,34.65,"InheemsAmfibieën"]
[514,"InheemsAmfibieën0051",47.25,"Inheems","Amfibieën",51,75,47.25,"InheemsAmfibieën"]
[515,"InheemsAmfibieën0076",63,"Inheems","Amfibieën",76,100,63,"InheemsAmfibieën"]
[402,"InheemsDuiven0001",1.02,"Inheems","Duiven",1,3,1.02,"InheemsDuiven"]
[403,"InheemsDuiven0004",3.4000000000000004,"Inheems","Duiven",4,10,3.4000000000000004,"InheemsDuiven"]
[404,"InheemsDuiven0011",8.5,"Inheems","Duiven",11,25,8.5,"InheemsDuiven"]
[405,"InheemsDuiven0026",17,"Inheems","Duiven",26,50,17,"InheemsDuiven"]
[406,"InheemsDuiven0051",34,"Inheems","Duiven",51,100,34,"InheemsDuiven"]
[407,"InheemsDuiven0101",51.000000000000007,"Inheems","Duiven",101,150,51.000000000000007,"InheemsDuiven"]
[408,"InheemsDuiven0151",68,"Inheems","Duiven",151,200,68,"InheemsDuiven"]
[409,"InheemsDuiven0201",85,"Inheems","Duiven",201,250,85,"InheemsDuiven"]
[410,"InheemsDuiven0251",102.00000000000001,"Inheems","Duiven",251,300,102.00000000000001,"InheemsDuiven"]
[411,"InheemsDuiven0301",119.00000000000001,"Inheems","Duiven",301,350,119.00000000000001,"InheemsDuiven"]
[412,"InheemsDuiven0351",136,"Inheems","Duiven",351,400,136,"InheemsDuiven"]
[413,"InheemsDuiven0401",153,"Inheems","Duiven",401,450,153,"InheemsDuiven"]
[414,"InheemsDuiven0451",170,"Inheems","Duiven",451,500,170,"InheemsDuiven"]
[415,"InheemsEenden en hoenderen0001",2.4000000000000004,"Inheems","Eenden en hoenderen",1,3,2.4000000000000004,"InheemsEenden en hoenderen"]
[416,"InheemsEenden en hoenderen0004",8,"Inheems","Eenden en hoenderen",4,10,8,"InheemsEenden en hoenderen"]
[417,"InheemsEenden en hoenderen0011",20,"Inheems","Eenden en hoenderen",11,25,20,"InheemsEenden en hoenderen"]
[418,"InheemsEenden en hoenderen0026",40,"Inheems","Eenden en hoenderen",26,50,40,"InheemsEenden en hoenderen"]
[419,"InheemsEenden en hoenderen0051",80,"Inheems","Eenden en hoenderen",51,100,80,"InheemsEenden en hoenderen"]
[420,"InheemsEenden en hoenderen0101",120,"Inheems","Eenden en hoenderen",101,150,120,"InheemsEenden en hoenderen"]
[421,"InheemsEenden en hoenderen0151",160,"Inheems","Eenden en hoenderen",151,200,160,"InheemsEenden en hoenderen"]
[422,"InheemsEenden en hoenderen0201",200,"Inheems","Eenden en hoenderen",201,250,200,"InheemsEenden en hoenderen"]
[423,"InheemsEenden en hoenderen0251",240,"Inheems","Eenden en hoenderen",251,300,240,"InheemsEenden en hoenderen"]
[424,"InheemsEenden en hoenderen0301",280,"Inheems","Eenden en hoenderen",301,350,280,"InheemsEenden en hoenderen"]
[425,"InheemsEenden en hoenderen0351",320,"Inheems","Eenden en hoenderen",351,400,320,"InheemsEenden en hoenderen"]
[426,"InheemsEenden en hoenderen0401",360,"Inheems","Eenden en hoenderen",401,450,360,"InheemsEenden en hoenderen"]
[427,"InheemsEenden en hoenderen0451",400,"Inheems","Eenden en hoenderen",451,500,400,"InheemsEenden en hoenderen"]
[522,"InheemsFazant & Wilde Eend0001",2.4000000000000004,"Inheems","Fazant & Wilde Eend",1,3,2.4000000000000004,"InheemsFazant & Wilde Eend"]
[523,"InheemsFazant & Wilde Eend0004",8,"Inheems","Fazant & Wilde Eend",4,10,8,"InheemsFazant & Wilde Eend"]
[524,"InheemsFazant & Wilde Eend0011",20,"Inheems","Fazant & Wilde Eend",11,25,20,"InheemsFazant & Wilde Eend"]
[525,"InheemsFazant & Wilde Eend0026",40,"Inheems","Fazant & Wilde Eend",26,50,40,"InheemsFazant & Wilde Eend"]
[526,"InheemsFazant & Wilde Eend0051",25,"Inheems","Fazant & Wilde Eend",51,75,25,"InheemsFazant & Wilde Eend"]
[527,"InheemsFazant & Wilde Eend0076",50,"Inheems","Fazant & Wilde Eend",76,100,50,"InheemsFazant & Wilde Eend"]
[528,"InheemsFazant & Wilde Eend0101",75,"Inheems","Fazant & Wilde Eend",101,200,75,"InheemsFazant & Wilde Eend"]
[529,"InheemsFazant & Wilde Eend0201",96,"Inheems","Fazant & Wilde Eend",201,300,96,"InheemsFazant & Wilde Eend"]
[530,"InheemsFazant & Wilde Eend0301",115,"Inheems","Fazant & Wilde Eend",301,400,115,"InheemsFazant & Wilde Eend"]
[531,"InheemsFazant & Wilde Eend0401",138,"Inheems","Fazant & Wilde Eend",401,500,138,"InheemsFazant & Wilde Eend"]
[532,"InheemsFazant & Wilde Eend0501",161,"Inheems","Fazant & Wilde Eend",501,600,161,"InheemsFazant & Wilde Eend"]
[533,"InheemsFazant & Wilde Eend0601",176,"Inheems","Fazant & Wilde Eend",601,700,176,"InheemsFazant & Wilde Eend"]
[534,"InheemsFazant & Wilde Eend0701",189,"Inheems","Fazant & Wilde Eend",701,800,189,"InheemsFazant & Wilde Eend"]
[535,"InheemsFazant & Wilde Eend0801",202,"Inheems","Fazant & Wilde Eend",801,900,202,"InheemsFazant & Wilde Eend"]
[536,"InheemsFazant & Wilde Eend0901",214,"Inheems","Fazant & Wilde Eend",901,1000,214,"InheemsFazant & Wilde Eend"]
[537,"InheemsFazant & Wilde Eend1001",300,"Inheems","Fazant & Wilde Eend",1001,1500,300,"InheemsFazant & Wilde Eend"]
[538,"InheemsFazant & Wilde Eend1501",375,"Inheems","Fazant & Wilde Eend",1501,2000,375,"InheemsFazant & Wilde Eend"]
[440,"InheemsGanzen en zwanen0001",3.4499999999999997,"Inheems","Ganzen en zwanen",1,3,3.4499999999999997,"InheemsGanzen en zwanen"]
[441,"InheemsGanzen en zwanen0004",11.5,"Inheems","Ganzen en zwanen",4,10,11.5,"InheemsGanzen en zwanen"]
[442,"InheemsGanzen en zwanen0011",28.749999999999996,"Inheems","Ganzen en zwanen",11,25,28.749999999999996,"InheemsGanzen en zwanen"]
[443,"InheemsGanzen en zwanen0026",57.499999999999993,"Inheems","Ganzen en zwanen",26,50,57.499999999999993,"InheemsGanzen en zwanen"]
[444,"InheemsGanzen en zwanen0051",86.25,"Inheems","Ganzen en zwanen",51,75,86.25,"InheemsGanzen en zwanen"]
[445,"InheemsGanzen en zwanen0076",114.99999999999999,"Inheems","Ganzen en zwanen",76,100,114.99999999999999,"InheemsGanzen en zwanen"]
[389,"InheemsInsectenetende wildzang0001",1.9500000000000002,"Inheems","Insectenetende wildzang",1,3,1.9500000000000002,"InheemsInsectenetende wildzang"]
[390,"InheemsInsectenetende wildzang0004",6.5,"Inheems","Insectenetende wildzang",4,10,6.5,"InheemsInsectenetende wildzang"]
[391,"InheemsInsectenetende wildzang0011",16.25,"Inheems","Insectenetende wildzang",11,25,16.25,"InheemsInsectenetende wildzang"]
[392,"InheemsInsectenetende wildzang0026",32.5,"Inheems","Insectenetende wildzang",26,50,32.5,"InheemsInsectenetende wildzang"]
[393,"InheemsInsectenetende wildzang0051",65,"Inheems","Insectenetende wildzang",51,100,65,"InheemsInsectenetende wildzang"]
[394,"InheemsInsectenetende wildzang0101",97.5,"Inheems","Insectenetende wildzang",101,150,97.5,"InheemsInsectenetende wildzang"]
[395,"InheemsInsectenetende wildzang0151",130,"Inheems","Insectenetende wildzang",151,200,130,"InheemsInsectenetende wildzang"]
[396,"InheemsInsectenetende wildzang0201",162.5,"Inheems","Insectenetende wildzang",201,250,162.5,"InheemsInsectenetende wildzang"]
[397,"InheemsInsectenetende wildzang0251",195,"Inheems","Insectenetende wildzang",251,300,195,"InheemsInsectenetende wildzang"]
[398,{"$f":"D66&E66&TEXT(F66,\"0000\")","v":"InheemsInsectenetende wildzang0301"},{"$f":"H66","v":227.5},"Inheems","Insectenetende wildzang",301,350,227.5,{"$f":"D66&E66","v":"InheemsInsectenetende wildzang"}]
[399,"InheemsInsectenetende wildzang0351",260,"Inheems","Insectenetende wildzang",351,400,260,"InheemsInsectenetende wildzang"]
[400,"InheemsInsectenetende wildzang0401",292.5,"Inheems","Insectenetende wildzang",401,450,292.5,"InheemsInsectenetende wildzang"]
[401,"InheemsInsectenetende wildzang0451",325,"Inheems","Insectenetende wildzang",451,500,325,"InheemsInsectenetende wildzang"]
[460,"InheemsKraaiachtigen0001",1.9500000000000002,"Inheems","Kraaiachtigen",1,3,1.9500000000000002,"InheemsKraaiachtigen"]
[461,"InheemsKraaiachtigen0005",6.5,"Inheems","Kraaiachtigen",5,10,6.5,"InheemsKraaiachtigen"]
[462,"InheemsKraaiachtigen0011",13,"Inheems","Kraaiachtigen",11,20,13,"InheemsKraaiachtigen"]
[463,"InheemsKraaiachtigen0021",22.75,"Inheems","Kraaiachtigen",21,35,22.75,"InheemsKraaiachtigen"]
[464,"InheemsKraaiachtigen0036",32.5,"Inheems","Kraaiachtigen",36,50,32.5,"InheemsKraaiachtigen"]
[465,"InheemsKraaiachtigen0051",48.75,"Inheems","Kraaiachtigen",51,75,48.75,"InheemsKraaiachtigen"]
[466,"InheemsKraaiachtigen0076",65,"Inheems","Kraaiachtigen",76,100,65,"InheemsKraaiachtigen"]
[539,"InheemsMeeuwachtigen0001",15.09,"Inheems","Meeuwachtigen",1,3,15.09,"InheemsMeeuwachtigen"]
[540,"InheemsMeeuwachtigen0004",30.18,"Inheems","Meeuwachtigen",4,6,30.18,"InheemsMeeuwachtigen"]
[541,"InheemsMeeuwachtigen0007",45.27,"Inheems","Meeuwachtigen",7,9,45.27,"InheemsMeeuwachtigen"]
[542,"InheemsMeeuwachtigen0010",60.36,"Inheems","Meeuwachtigen",10,12,60.36,"InheemsMeeuwachtigen"]
[543,"InheemsMeeuwachtigen0013",75.45,"Inheems","Meeuwachtigen",13,15,75.45,"InheemsMeeuwachtigen"]
[544,"InheemsMeeuwachtigen0016",85.51,"Inheems","Meeuwachtigen",16,17,85.51,"InheemsMeeuwachtigen"]
[545,"InheemsMeeuwachtigen0018",100.60000000000001,"Inheems","Meeuwachtigen",18,20,100.60000000000001,"InheemsMeeuwachtigen"]
[446,"InheemsReigers, ooievaars, kraanvogels0001",10.06,"Inheems","Reigers, ooievaars, kraanvogels",1,2,10.06,"InheemsReigers, ooievaars, kraanvogels"]
[447,"InheemsReigers, ooievaars, kraanvogels0003",25.150000000000002,"Inheems","Reigers, ooievaars, kraanvogels",3,5,25.150000000000002,"InheemsReigers, ooievaars, kraanvogels"]
[448,"InheemsReigers, ooievaars, kraanvogels0006",45.27,"Inheems","Reigers, ooievaars, kraanvogels",6,9,45.27,"InheemsReigers, ooievaars, kraanvogels"]
[449,"InheemsReigers, ooievaars, kraanvogels0010",60.36,"Inheems","Reigers, ooievaars, kraanvogels",10,12,60.36,"InheemsReigers, ooievaars, kraanvogels"]
[450,"InheemsReigers, ooievaars, kraanvogels0013",75.45,"Inheems","Reigers, ooievaars, kraanvogels",13,15,75.45,"InheemsReigers, ooievaars, kraanvogels"]
[451,"InheemsReigers, ooievaars, kraanvogels0016",85.51,"Inheems","Reigers, ooievaars, kraanvogels",16,17,85.51,"InheemsReigers, ooievaars, kraanvogels"]
[452,"InheemsReigers, ooievaars, kraanvogels0018",100.60000000000001,"Inheems","Reigers, ooievaars, kraanvogels",18,20,100.60000000000001,"InheemsReigers, ooievaars, kraanvogels"]
[516,"InheemsReptielen0001",9.1,"Inheems","Reptielen",1,5,9.1,"InheemsReptielen"]
[517,"InheemsReptielen0006",27.3,"Inheems","Reptielen",6,15,27.3,"InheemsReptielen"]
[518,"InheemsReptielen0016",63.7,"Inheems","Reptielen",16,35,63.7,"InheemsReptielen"]
[519,"InheemsReptielen0036",100.10000000000001,"Inheems","Reptielen",36,55,100.10000000000001,"InheemsReptielen"]
[520,"InheemsReptielen0051",136.5,"Inheems","Reptielen",51,75,136.5,"InheemsReptielen"]
[521,"InheemsReptielen0076",182,"Inheems","Reptielen",76,100,182,"InheemsReptielen"]
[467,"InheemsRoofvogels (categorie A+B)0001",6.22,"Inheems","Roofvogels (categorie A+B)",1,2,6.22,"InheemsRoofvogels (categorie A+B)"]
[468,"InheemsRoofvogels (categorie A+B)0003",15.549999999999999,"Inheems","Roofvogels (categorie A+B)",3,5,15.549999999999999,"InheemsRoofvogels (categorie A+B)"]
[469,"InheemsRoofvogels (categorie A+B)0006",27.99,"Inheems","Roofvogels (categorie A+B)",6,9,27.99,"InheemsRoofvogels (categorie A+B)"]
[470,"InheemsRoofvogels (categorie A+B)0010",37.32,"Inheems","Roofvogels (categorie A+B)",10,12,37.32,"InheemsRoofvogels (categorie A+B)"]
[471,"InheemsRoofvogels (categorie A+B)0013",46.65,"Inheems","Roofvogels (categorie A+B)",13,15,46.65,"InheemsRoofvogels (categorie A+B)"]
[472,"InheemsRoofvogels (categorie C)0001",12.600000000000001,"Inheems","Roofvogels (categorie C)",1,3,12.600000000000001,"InheemsRoofvogels (categorie C)"]
[473,"InheemsRoofvogels (categorie C)0004",25.200000000000003,"Inheems","Roofvogels (categorie C)",4,6,25.200000000000003,"InheemsRoofvogels (categorie C)"]
[474,"InheemsRoofvogels (categorie C)0007",37.800000000000004,"Inheems","Roofvogels (categorie C)",7,9,37.800000000000004,"InheemsRoofvogels (categorie C)"]
[475,"InheemsRoofvogels (categorie C)0010",50.400000000000006,"Inheems","Roofvogels (categorie C)",10,12,50.400000000000006,"InheemsRoofvogels (categorie C)"]
[476,"InheemsRoofvogels (categorie C)0013",63,"Inheems","Roofvogels (categorie C)",13,15,63,"InheemsRoofvogels (categorie C)"]
[477,"InheemsRoofvogels (categorie D)0001",14.399999999999999,"Inheems","Roofvogels (categorie D)",1,3,14.399999999999999,"InheemsRoofvogels (categorie D)"]
[478,"InheemsRoofvogels (categorie D)0004",28.799999999999997,"Inheems","Roofvogels (categorie D)",4,6,28.799999999999997,"InheemsRoofvogels (categorie D)"]
[479,"InheemsRoofvogels (categorie D)0007",43.199999999999996,"Inheems","Roofvogels (categorie D)",7,9,43.199999999999996,"InheemsRoofvogels (categorie D)"]
[480,"InheemsRoofvogels (categorie D)0010",57.599999999999994,"Inheems","Roofvogels (categorie D)",10,12,57.599999999999994,"InheemsRoofvogels (categorie D)"]
[481,"InheemsRoofvogels (categorie D)0013",72,"Inheems","Roofvogels (categorie D)",13,15,72,"InheemsRoofvogels (categorie D)"]
[482,"InheemsRoofvogels (categorie E)0001",15.600000000000001,"Inheems","Roofvogels (categorie E)",1,3,15.600000000000001,"InheemsRoofvogels (categorie E)"]
[483,"InheemsRoofvogels (categorie E)0004",31.200000000000003,"Inheems","Roofvogels (categorie E)",4,6,31.200000000000003,"InheemsRoofvogels (categorie E)"]
[484,"InheemsRoofvogels (categorie E)0007",46.800000000000004,"Inheems","Roofvogels (categorie E)",7,9,46.800000000000004,"InheemsRoofvogels (categorie E)"]
[485,"InheemsRoofvogels (categorie E)0010",62.400000000000006,"Inheems","Roofvogels (categorie E)",10,12,62.400000000000006,"InheemsRoofvogels (categorie E)"]
[486,"InheemsRoofvogels (categorie E)0013",78,"Inheems","Roofvogels (categorie E)",13,15,78,"InheemsRoofvogels (categorie E)"]
[487,"InheemsRoofvogels (categorie F)0001",18.899999999999999,"Inheems","Roofvogels (categorie F)",1,3,18.899999999999999,"InheemsRoofvogels (categorie F)"]
[488,"InheemsRoofvogels (categorie F)0004",37.799999999999997,"Inheems","Roofvogels (categorie F)",4,6,37.799999999999997,"InheemsRoofvogels (categorie F)"]
[489,"InheemsRoofvogels (categorie F)0007",56.699999999999996,"Inheems","Roofvogels (categorie F)",7,9,56.699999999999996,"InheemsRoofvogels (categorie F)"]
[490,"InheemsRoofvogels (categorie F)0010",75.599999999999994,"Inheems","Roofvogels (categorie F)",10,12,75.599999999999994,"InheemsRoofvogels (categorie F)"]
[491,"InheemsRoofvogels (categorie F)0013",94.5,"Inheems","Roofvogels (categorie F)",13,15,94.5,"InheemsRoofvogels (categorie F)"]
[428,"InheemsWaad- en Weidevogels0001",2.7,"Inheems","Waad- en Weidevogels",1,3,2.7,"InheemsWaad- en Weidevogels"]
[429,"InheemsWaad- en Weidevogels0004",9,"Inheems","Waad- en Weidevogels",4,10,9,"InheemsWaad- en Weidevogels"]
[430,"InheemsWaad- en Weidevogels0011",22.5,"Inheems","Waad- en Weidevogels",11,25,22.5,"InheemsWaad- en Weidevogels"]
[431,"InheemsWaad- en Weidevogels0026",49.5,"Inheems","Waad- en Weidevogels",26,55,49.5,"InheemsWaad- en Weidevogels"]
[432,"InheemsWaad- en Weidevogels0056",67.5,"Inheems","Waad- en Weidevogels",56,75,67.5,"InheemsWaad- en Weidevogels"]
[433,"InheemsWaad- en Weidevogels0076",90,"Inheems","Waad- en Weidevogels",76,100,90,"InheemsWaad- en Weidevogels"]
[376,"InheemsZaadetende wildzang0001",0.39,"Inheems","Zaadetende wildzang",1,3,{"$f":"G128*0.13","v":0.39},"InheemsZaadetende wildzang"]
[377,"InheemsZaadetende wildzang0004",3.4000000000000004,"Inheems","Zaadetende wildzang",4,10,3.4000000000000004,"InheemsZaadetende wildzang"]
[378,{"$f":"D130&E130&TEXT(F130,\"0000\")","v":"InheemsZaadetende wildzang0011"},{"$f":"H130","v":8.5},"Inheems","Zaadetende wildzang",11,25,8.5,{"$f":"D130&E130","v":"InheemsZaadetende wildzang"}]
[379,"InheemsZaadetende wildzang0026",17,"Inheems","Zaadetende wildzang",26,50,17,"InheemsZaadetende wildzang"]
[380,"InheemsZaadetende wildzang0051",34,"Inheems","Zaadetende wildzang",51,100,34,"InheemsZaadetende wildzang"]
[381,"InheemsZaadetende wildzang0101",51.000000000000007,"Inheems","Zaadetende wildzang",101,150,51.000000000000007,"InheemsZaadetende wildzang"]
[382,"InheemsZaadetende wildzang0151",68,"Inheems","Zaadetende wildzang",151,200,68,"InheemsZaadetende wildzang"]
[383,"InheemsZaadetende wildzang0201",85,"Inheems","Zaadetende wildzang",201,250,85,"InheemsZaadetende wildzang"]
[384,"InheemsZaadetende wildzang0251",102.00000000000001,"Inheems","Zaadetende wildzang",251,300,102.00000000000001,"InheemsZaadetende wildzang"]
[385,"InheemsZaadetende wildzang0301",119.00000000000001,"Inheems","Zaadetende wildzang",301,350,119.00000000000001,"InheemsZaadetende wildzang"]
[386,"InheemsZaadetende wildzang0351",136,"Inheems","Zaadetende wildzang",351,400,136,"InheemsZaadetende wildzang"]
[387,"InheemsZaadetende wildzang0401",153,"Inheems","Zaadetende wildzang",401,450,153,"InheemsZaadetende wildzang"]
[388,"InheemsZaadetende wildzang0451",170,"Inheems","Zaadetende wildzang",451,500,170,"InheemsZaadetende wildzang"]
[434,"InheemsZeevogels0001",3,"Inheems","Zeevogels",1,3,3,"InheemsZeevogels"]
[453,"InheemsZeevogels0001",15.09,"Inheems","Zeevogels",1,3,15.09,"InheemsZeevogels"]
[435,"InheemsZeevogels0004",10,"Inheems","Zeevogels",4,10,10,"InheemsZeevogels"]
[454,"InheemsZeevogels0004",30.18,"Inheems","Zeevogels",4,6,30.18,"InheemsZeevogels"]
[455,"InheemsZeevogels0007",45.27,"Inheems","Zeevogels",7,9,45.27,"InheemsZeevogels"]
[456,"InheemsZeevogels0010",60.36,"Inheems","Zeevogels",10,12,60.36,"InheemsZeevogels"]
[436,"InheemsZeevogels0011",25,"Inheems","Zeevogels",11,25,25,"InheemsZeevogels"]
[457,"InheemsZeevogels0013",75.45,"Inheems","Zeevogels",13,15,75.45,"InheemsZeevogels"]
[458,"InheemsZeevogels0016",85.51,"Inheems","Zeevogels",16,17,85.51,"InheemsZeevogels"]
[459,"InheemsZeevogels0018",100.60000000000001,"Inheems","Zeevogels",18,20,100.60000000000001,"InheemsZeevogels"]
[437,"InheemsZeevogels0026",50,"Inheems","Zeevogels",26,50,50,"InheemsZeevogels"]
[438,"InheemsZeevogels0051",75,"Inheems","Zeevogels",51,75,75,"InheemsZeevogels"]
[439,"InheemsZeevogels0076",100,"Inheems","Zeevogels",76,100,100,"InheemsZeevogels"]
[504,"InheemsZoogdieren - groot0001",28.92,"Inheems","Zoogdieren - groot",1,3,28.92,"InheemsZoogdieren - groot"]
[505,"InheemsZoogdieren - groot0004",57.84,"Inheems","Zoogdieren - groot",4,6,57.84,"InheemsZoogdieren - groot"]
[506,"InheemsZoogdieren - groot0007",86.76,"Inheems","Zoogdieren - groot",7,9,86.76,"InheemsZoogdieren - groot"]
[507,"InheemsZoogdieren - groot0010",115.68,"Inheems","Zoogdieren - groot",10,12,115.68,"InheemsZoogdieren - groot"]
[508,"InheemsZoogdieren - groot0013",144.60000000000002,"Inheems","Zoogdieren - groot",13,15,144.60000000000002,"InheemsZoogdieren - groot"]
[509,"InheemsZoogdieren - groot0016",173.52,"Inheems","Zoogdieren - groot",16,18,173.52,"InheemsZoogdieren - groot"]
[492,"InheemsZoogdieren - klein0001",5.9399999999999995,"Inheems","Zoogdieren - klein",1,3,5.9399999999999995,"InheemsZoogdieren - klein"]
[493,"InheemsZoogdieren - klein0004",11.879999999999999,"Inheems","Zoogdieren - klein",4,6,11.879999999999999,"InheemsZoogdieren - klein"]
[494,"InheemsZoogdieren - klein0007",17.82,"Inheems","Zoogdieren - klein",7,9,17.82,"InheemsZoogdieren - klein"]
[495,"InheemsZoogdieren - klein0010",23.759999999999998,"Inheems","Zoogdieren - klein",10,12,23.759999999999998,"InheemsZoogdieren - klein"]
[496,"InheemsZoogdieren - klein0013",29.7,"Inheems","Zoogdieren - klein",13,15,29.7,"InheemsZoogdieren - klein"]
[497,"InheemsZoogdieren - klein0016",35.64,"Inheems","Zoogdieren - klein",16,18,35.64,"InheemsZoogdieren - klein"]
[498,"InheemsZoogdieren - middel0001",16.200000000000003,"Inheems","Zoogdieren - middel",1,3,16.200000000000003,"InheemsZoogdieren - middel"]
[499,"InheemsZoogdieren - middel0004",32.400000000000006,"Inheems","Zoogdieren - middel",4,6,32.400000000000006,"InheemsZoogdieren - middel"]
[500,"InheemsZoogdieren - middel0007",48.6,"Inheems","Zoogdieren - middel",7,9,48.6,"InheemsZoogdieren - middel"]
[501,"InheemsZoogdieren - middel0010",64.800000000000011,"Inheems","Zoogdieren - middel",10,12,64.800000000000011,"InheemsZoogdieren - middel"]
[502,"InheemsZoogdieren - middel0013",81,"Inheems","Zoogdieren - middel",13,15,81,"InheemsZoogdieren - middel"]
[503,"InheemsZoogdieren - middel0016",97.2,"Inheems","Zoogdieren - middel",16,18,97.2,"InheemsZoogdieren - middel"]
[224,"UitheemsAmfibieen - groot0001",2.56,"Uitheems","Amfibieen - groot",1,2,2.56,"UitheemsAmfibieen - groot"]
[225,"UitheemsAmfibieen - groot0003",6.4,"Uitheems","Amfibieen - groot",3,5,6.4,"UitheemsAmfibieen - groot"]
[226,"UitheemsAmfibieen - groot0006",11.52,"Uitheems","Amfibieen - groot",6,9,11.52,"UitheemsAmfibieen - groot"]
[227,"UitheemsAmfibieen - groot0010",19.2,"Uitheems","Amfibieen - groot",10,15,19.2,"UitheemsAmfibieen - groot"]
[228,"UitheemsAmfibieen - groot0016",25.6,"Uitheems","Amfibieen - groot",16,20,25.6,"UitheemsAmfibieen - groot"]
[229,"UitheemsAmfibieen - groot0021",38.4,"Uitheems","Amfibieen - groot",21,30,38.4,"UitheemsAmfibieen - groot"]
[230,"UitheemsAmfibieen - groot0031",51.2,"Uitheems","Amfibieen - groot",31,40,51.2,"UitheemsAmfibieen - groot"]
[231,"UitheemsAmfibieen - groot0041",64,"Uitheems","Amfibieen - groot",41,50,64,"UitheemsAmfibieen - groot"]
[232,"UitheemsAmfibieen - groot0051",76.8,"Uitheems","Amfibieen - groot",51,60,76.8,"UitheemsAmfibieen - groot"]
[233,"UitheemsAmfibieen - groot0061",89.600000000000009,"Uitheems","Amfibieen - groot",61,70,89.600000000000009,"UitheemsAmfibieen - groot"]
[234,"UitheemsAmfibieen - groot0071",102.4,"Uitheems","Amfibieen - groot",71,80,102.4,"UitheemsAmfibieen - groot"]
[235,"UitheemsAmfibieen - groot0081",115.2,"Uitheems","Amfibieen - groot",81,90,115.2,"UitheemsAmfibieen - groot"]
[236,"UitheemsAmfibieen - groot0091",128,"Uitheems","Amfibieen - groot",91,100,128,"UitheemsAmfibieen - groot"]
[237,"UitheemsAmfibieen - groot0101",153.6,"Uitheems","Amfibieen - groot",101,120,153.6,"UitheemsAmfibieen - groot"]
[196,"UitheemsAmfibieen - klein0001",3.15,"Uitheems","Amfibieen - klein",1,5,3.15,"UitheemsAmfibieen - klein"]
[197,"UitheemsAmfibieen - klein0006",9.4499999999999993,"Uitheems","Amfibieen - klein",6,15,9.4499999999999993,"UitheemsAmfibieen - klein"]
[198,"UitheemsAmfibieen - klein0016",22.05,"Uitheems","Amfibieen - klein",16,35,22.05,"UitheemsAmfibieen - klein"]
[199,"UitheemsAmfibieen - klein0036",34.65,"Uitheems","Amfibieen - klein",36,55,34.65,"UitheemsAmfibieen - klein"]
[200,"UitheemsAmfibieen - klein0051",47.25,"Uitheems","Amfibieen - klein",51,75,47.25,"UitheemsAmfibieen - klein"]
[201,"UitheemsAmfibieen - klein0076",63,"Uitheems","Amfibieen - klein",76,100,63,"UitheemsAmfibieen - klein"]
[202,"UitheemsAmfibieen - klein0101",94.5,"Uitheems","Amfibieen - klein",101,150,94.5,"UitheemsAmfibieen - klein"]
[203,"UitheemsAmfibieen - klein0151",126,"Uitheems","Amfibieen - klein",151,200,126,"UitheemsAmfibieen - klein"]
[204,{"$f":"D194&E194&TEXT(F194,\"0000\")","v":"UitheemsAmfibieen - klein0201"},{"$f":"H194","v":157.5},"Uitheems","Amfibieen - klein",201,250,157.5,{"$f":"D194&E194","v":"UitheemsAmfibieen - klein"}]
[205,"UitheemsAmfibieen - klein0251",189,"Uitheems","Amfibieen - klein",251,300,189,"UitheemsAmfibieen - klein"]
[206,"UitheemsAmfibieen - klein0301",220.5,"Uitheems","Amfibieen - klein",301,350,220.5,"UitheemsAmfibieen - klein"]
[207,"UitheemsAmfibieen - klein0351",252,"Uitheems","Amfibieen - klein",351,400,252,"UitheemsAmfibieen - klein"]
[208,"UitheemsAmfibieen - klein0401",283.5,"Uitheems","Amfibieen - klein",401,450,283.5,"UitheemsAmfibieen - klein"]
[209,"UitheemsAmfibieen - klein0451",315,"Uitheems","Amfibieen - klein",451,500,315,"UitheemsAmfibieen - klein"]
[210,"UitheemsAmfibieen - middel0001",4.0999999999999996,"Uitheems","Amfibieen - middel",1,5,4.0999999999999996,"UitheemsAmfibieen - middel"]
[211,"UitheemsAmfibieen - middel0006",12.299999999999999,"Uitheems","Amfibieen - middel",6,15,12.299999999999999,"UitheemsAmfibieen - middel"]
[212,"UitheemsAmfibieen - middel0016",28.7,"Uitheems","Amfibieen - middel",16,35,28.7,"UitheemsAmfibieen - middel"]
[213,"UitheemsAmfibieen - middel0036",45.099999999999994,"Uitheems","Amfibieen - middel",36,55,45.099999999999994,"UitheemsAmfibieen - middel"]
[214,"UitheemsAmfibieen - middel0051",61.499999999999993,"Uitheems","Amfibieen - middel",51,75,61.499999999999993,"UitheemsAmfibieen - middel"]
[215,"UitheemsAmfibieen - middel0076",82,"Uitheems","Amfibieen - middel",76,100,82,"UitheemsAmfibieen - middel"]
[216,"UitheemsAmfibieen - middel0101",122.99999999999999,"Uitheems","Amfibieen - middel",101,150,122.99999999999999,"UitheemsAmfibieen - middel"]
[217,"UitheemsAmfibieen - middel0151",164,"Uitheems","Amfibieen - middel",151,200,164,"UitheemsAmfibieen - middel"]
[218,"UitheemsAmfibieen - middel0201",205,"Uitheems","Amfibieen - middel",201,250,205,"UitheemsAmfibieen - middel"]
[219,"UitheemsAmfibieen - middel0251",245.99999999999997,"Uitheems","Amfibieen - middel",251,300,245.99999999999997,"UitheemsAmfibieen - middel"]
[220,"UitheemsAmfibieen - middel0301",287,"Uitheems","Amfibieen - middel",301,350,287,"UitheemsAmfibieen - middel"]
[221,"UitheemsAmfibieen - middel0351",328,"Uitheems","Amfibieen - middel",351,400,328,"UitheemsAmfibieen - middel"]
[222,"UitheemsAmfibieen - middel0401",369,"Uitheems","Amfibieen - middel",401,450,369,"UitheemsAmfibieen - middel"]
[223,"UitheemsAmfibieen - middel0451",410,"Uitheems","Amfibieen - middel",451,500,410,"UitheemsAmfibieen - middel"]
[50,"UitheemsEenden en hoenderen0001",4,"Uitheems","Eenden en hoenderen",1,5,4,"UitheemsEenden en hoenderen"]
[51,"UitheemsEenden en hoenderen0006",12,"Uitheems","Eenden en hoenderen",6,15,12,"UitheemsEenden en hoenderen"]
[52,"UitheemsEenden en hoenderen0016",28,"Uitheems","Eenden en hoenderen",16,35,28,"UitheemsEenden en hoenderen"]
[53,"UitheemsEenden en hoenderen0036",44,"Uitheems","Eenden en hoenderen",36,55,44,"UitheemsEenden en hoenderen"]
[54,"UitheemsEenden en hoenderen0051",60,"Uitheems","Eenden en hoenderen",51,75,60,"UitheemsEenden en hoenderen"]
[55,"UitheemsEenden en hoenderen0076",80,"Uitheems","Eenden en hoenderen",76,100,80,"UitheemsEenden en hoenderen"]
[56,"UitheemsEenden en hoenderen0101",120,"Uitheems","Eenden en hoenderen",101,150,120,"UitheemsEenden en hoenderen"]
[57,"UitheemsEenden en hoenderen0151",160,"Uitheems","Eenden en hoenderen",151,200,160,"UitheemsEenden en hoenderen"]
[58,"UitheemsEenden en hoenderen0201",200,"Uitheems","Eenden en hoenderen",201,250,200,"UitheemsEenden en hoenderen"]
[59,"UitheemsEenden en hoenderen0251",240,"Uitheems","Eenden en hoenderen",251,300,240,"UitheemsEenden en hoenderen"]
[60,"UitheemsEenden en hoenderen0301",280,"Uitheems","Eenden en hoenderen",301,350,280,"UitheemsEenden en hoenderen"]
[61,"UitheemsEenden en hoenderen0351",320,"Uitheems","Eenden en hoenderen",351,400,320,"UitheemsEenden en hoenderen"]
[62,"UitheemsEenden en hoenderen0401",360,"Uitheems","Eenden en hoenderen",401,450,360,"UitheemsEenden en hoenderen"]
[63,"UitheemsEenden en hoenderen0451",400,"Uitheems","Eenden en hoenderen",451,500,400,"UitheemsEenden en hoenderen"]
[89,"UitheemsGanzen en zwanen0001",5.75,"Uitheems","Ganzen en zwanen",1,5,5.75,"UitheemsGanzen en zwanen"]
[90,"UitheemsGanzen en zwanen0006",17.25,"Uitheems","Ganzen en zwanen",6,15,17.25,"UitheemsGanzen en zwanen"]
[91,"UitheemsGanzen en zwanen0016",40.25,"Uitheems","Ganzen en zwanen",16,35,40.25,"UitheemsGanzen en zwanen"]
[92,"UitheemsGanzen en zwanen0036",63.249999999999993,"Uitheems","Ganzen en zwanen",36,55,63.249999999999993,"UitheemsGanzen en zwanen"]
[93,"UitheemsGanzen en zwanen0051",86.25,"Uitheems","Ganzen en zwanen",51,75,86.25,"UitheemsGanzen en zwanen"]
[94,"UitheemsGanzen en zwanen0076",114.99999999999999,"Uitheems","Ganzen en zwanen",76,100,114.99999999999999,"UitheemsGanzen en zwanen"]
[316,"UitheemsGeleedpotigen0001",1.64,"Uitheems","Geleedpotigen",1,2,1.64,"UitheemsGeleedpotigen"]
[317,"UitheemsGeleedpotigen0003",3.28,"Uitheems","Geleedpotigen",3,4,3.28,"UitheemsGeleedpotigen"]
[318,"UitheemsGeleedpotigen0005",4.92,"Uitheems","Geleedpotigen",5,6,4.92,"UitheemsGeleedpotigen"]
[319,"UitheemsGeleedpotigen0007",6.56,"Uitheems","Geleedpotigen",7,8,6.56,"UitheemsGeleedpotigen"]
[320,"UitheemsGeleedpotigen0009",8.1999999999999993,"Uitheems","Geleedpotigen",9,10,8.1999999999999993,"UitheemsGeleedpotigen"]
[321,"UitheemsGeleedpotigen0011",9.84,"Uitheems","Geleedpotigen",11,12,9.84,"UitheemsGeleedpotigen"]
[322,"UitheemsGeleedpotigen0013",11.479999999999999,"Uitheems","Geleedpotigen",13,14,11.479999999999999,"UitheemsGeleedpotigen"]
[323,"UitheemsGeleedpotigen0015",13.12,"Uitheems","Geleedpotigen",15,16,13.12,"UitheemsGeleedpotigen"]
[324,"UitheemsGeleedpotigen0017",14.76,"Uitheems","Geleedpotigen",17,18,14.76,"UitheemsGeleedpotigen"]
[325,"UitheemsGeleedpotigen0019",16.399999999999999,"Uitheems","Geleedpotigen",19,20,16.399999999999999,"UitheemsGeleedpotigen"]
[138,"UitheemsGrote herbivoren0001",30.9,"Uitheems","Grote herbivoren",1,1,30.9,"UitheemsGrote herbivoren"]
[139,"UitheemsGrote herbivoren0002",61.8,"Uitheems","Grote herbivoren",2,2,{"$f":"F245*30.9","v":61.8},"UitheemsGrote herbivoren"]
[140,"UitheemsGrote herbivoren0003",92.699999999999989,"Uitheems","Grote herbivoren",3,3,92.699999999999989,"UitheemsGrote herbivoren"]
[141,"UitheemsGrote herbivoren0004",123.6,"Uitheems","Grote herbivoren",4,4,123.6,"UitheemsGrote herbivoren"]
[142,"UitheemsGrote herbivoren0005",154.5,"Uitheems","Grote herbivoren",5,5,154.5,"UitheemsGrote herbivoren"]
[143,"UitheemsGrote herbivoren0006",185.39999999999998,"Uitheems","Grote herbivoren",6,6,185.39999999999998,"UitheemsGrote herbivoren"]
[144,"UitheemsGrote herbivoren0007",216.29999999999998,"Uitheems","Grote herbivoren",7,7,216.29999999999998,"UitheemsGrote herbivoren"]
[155,"UitheemsGrote katachtigen0001",30.9,"Uitheems","Grote katachtigen",1,1,30.9,"UitheemsGrote katachtigen"]
[156,"UitheemsGrote katachtigen0002",60.18,"Uitheems","Grote katachtigen",2,2,{"$f":"G252*30.09","v":60.18},"UitheemsGrote katachtigen"]
[157,"UitheemsGrote katachtigen0003",90.27,"Uitheems","Grote katachtigen",3,3,{"$f":"G253*30.09","v":90.27},"UitheemsGrote katachtigen"]
[158,"UitheemsGrote katachtigen0004",120.36,"Uitheems","Grote katachtigen",4,4,{"$f":"G254*30.09","v":120.36},"UitheemsGrote katachtigen"]
[159,"UitheemsGrote katachtigen0005",150.44999999999999,"Uitheems","Grote katachtigen",5,5,{"$f":"G255*30.09","v":150.44999999999999},"UitheemsGrote katachtigen"]
[160,"UitheemsGrote katachtigen0006",180.54,"Uitheems","Grote katachtigen",6,6,{"$f":"G256*30.09","v":180.54},"UitheemsGrote katachtigen"]
[286,"UitheemsHagedissen0001",5.0999999999999996,"Uitheems","Hagedissen",1,3,5.0999999999999996,"UitheemsHagedissen"]
[287,{"$f":"D258&E258&TEXT(F258,\"0000\")","v":"UitheemsHagedissen0004"},{"$f":"H258","v":11.9},"Uitheems","Hagedissen",4,7,11.9,{"$f":"D258&E258","v":"UitheemsHagedissen"}]
[288,"UitheemsHagedissen0008",17,"Uitheems","Hagedissen",8,10,17,"UitheemsHagedissen"]
[289,"UitheemsHagedissen0010",20.399999999999999,"Uitheems","Hagedissen",10,12,20.399999999999999,"UitheemsHagedissen"]
[290,"UitheemsHagedissen0013",25.5,"Uitheems","Hagedissen",13,15,25.5,"UitheemsHagedissen"]
[291,"UitheemsHagedissen0016",30.599999999999998,"Uitheems","Hagedissen",16,18,30.599999999999998,"UitheemsHagedissen"]
[292,"UitheemsHagedissen0019",35.699999999999996,"Uitheems","Hagedissen",19,21,35.699999999999996,"UitheemsHagedissen"]
[293,"UitheemsHagedissen0022",40.799999999999997,"Uitheems","Hagedissen",22,24,40.799999999999997,"UitheemsHagedissen"]
[294,"UitheemsHagedissen0025",45.9,"Uitheems","Hagedissen",25,27,45.9,"UitheemsHagedissen"]
[295,"UitheemsHagedissen0028",51,"Uitheems","Hagedissen",28,30,51,"UitheemsHagedissen"]
[145,"UitheemsKleine/Middel katachtigen0001",5.4,"Uitheems","Kleine/Middel katachtigen",1,1,5.4,"UitheemsKleine/Middel katachtigen"]
[146,"UitheemsKleine/Middel katachtigen0002",10.8,"Uitheems","Kleine/Middel katachtigen",2,2,{"$f":"G268*5.4","v":10.8},"UitheemsKleine/Middel katachtigen"]
[147,"UitheemsKleine/Middel katachtigen0003",16.200000000000003,"Uitheems","Kleine/Middel katachtigen",3,3,16.200000000000003,"UitheemsKleine/Middel katachtigen"]
[148,"UitheemsKleine/Middel katachtigen0004",21.6,"Uitheems","Kleine/Middel katachtigen",4,4,21.6,"UitheemsKleine/Middel katachtigen"]
[149,"UitheemsKleine/Middel katachtigen0005",27,"Uitheems","Kleine/Middel katachtigen",5,5,27,"UitheemsKleine/Middel katachtigen"]
[150,"UitheemsKleine/Middel katachtigen0006",32.400000000000006,"Uitheems","Kleine/Middel katachtigen",6,6,32.400000000000006,"UitheemsKleine/Middel katachtigen"]
[151,"UitheemsKleine/Middel katachtigen0007",37.800000000000004,"Uitheems","Kleine/Middel katachtigen",7,7,37.800000000000004,"UitheemsKleine/Middel katachtigen"]
[152,"UitheemsKleine/Middel katachtigen0008",43.2,"Uitheems","Kleine/Middel katachtigen",8,8,43.2,"UitheemsKleine/Middel katachtigen"]
[153,"UitheemsKleine/Middel katachtigen0009",48.6,"Uitheems","Kleine/Middel katachtigen",9,9,48.6,"UitheemsKleine/Middel katachtigen"]
[154,"UitheemsKleine/Middel katachtigen0010",54,"Uitheems","Kleine/Middel katachtigen",10,10,54,"UitheemsKleine/Middel katachtigen"]
[356,"UitheemsKoraal0001",0.13,"Uitheems","Koraal",1,1,0.13,"UitheemsKoraal"]
[357,"UitheemsKoraal0002",0.26,"Uitheems","Koraal",2,2,{"$f":"G278*0.13","v":0.26},"UitheemsKoraal"]
[358,"UitheemsKoraal0003",0.39,"Uitheems","Koraal",3,3,0.39,"UitheemsKoraal"]
[359,"UitheemsKoraal0004",0.52,"Uitheems","Koraal",4,4,0.52,"UitheemsKoraal"]
[360,"UitheemsKoraal0005",0.65,"Uitheems","Koraal",5,5,0.65,"UitheemsKoraal"]
[361,"UitheemsKoraal0006",0.78,"Uitheems","Koraal",6,6,0.78,"UitheemsKoraal"]
[362,"UitheemsKoraal0007",0.91,"Uitheems","Koraal",7,7,0.91,"UitheemsKoraal"]
[363,"UitheemsKoraal0008",1.04,"Uitheems","Koraal",8,8,1.04,"UitheemsKoraal"]
[364,"UitheemsKoraal0009",1.17,"Uitheems","Koraal",9,9,1.17,"UitheemsKoraal"]
[365,"UitheemsKoraal0010",1.3,"Uitheems","Koraal",10,10,1.3,"UitheemsKoraal"]
[366,"UitheemsKoraal0011",1.4300000000000002,"Uitheems","Koraal",11,11,1.4300000000000002,"UitheemsKoraal"]
[367,"UitheemsKoraal0012",1.56,"Uitheems","Koraal",12,12,1.56,"UitheemsKoraal"]
[368,"UitheemsKoraal0013",1.69,"Uitheems","Koraal",13,13,1.69,"UitheemsKoraal"]
[369,"UitheemsKoraal0014",1.82,"Uitheems","Koraal",14,14,1.82,"UitheemsKoraal"]
[370,"UitheemsKoraal0015",1.9500000000000002,"Uitheems","Koraal",15,15,1.9500000000000002,"UitheemsKoraal"]
[371,"UitheemsKoraal0016",2.08,"Uitheems","Koraal",16,16,2.08,"UitheemsKoraal"]
[372,"UitheemsKoraal0017",2.21,"Uitheems","Koraal",17,17,2.21,"UitheemsKoraal"]
[373,"UitheemsKoraal0018",2.34,"Uitheems","Koraal",18,18,2.34,"UitheemsKoraal"]
[374,"UitheemsKoraal0019",2.4700000000000002,"Uitheems","Koraal",19,19,2.4700000000000002,"UitheemsKoraal"]
[375,"UitheemsKoraal0020",2.6,"Uitheems","Koraal",20,20,2.6,"UitheemsKoraal"]
[238,"UitheemsKrokodillen  < 1 m0001",5.5500000000000007,"Uitheems","Krokodillen  < 1 m",1,3,5.5500000000000007,"UitheemsKrokodillen  < 1 m"]
[239,"UitheemsKrokodillen  < 1 m0004",18.5,"Uitheems","Krokodillen  < 1 m",4,10,18.5,"UitheemsKrokodillen  < 1 m"]
[240,"UitheemsKrokodillen  < 1 m0011",37,"Uitheems","Krokodillen  < 1 m",11,20,37,"UitheemsKrokodillen  < 1 m"]
[241,"UitheemsKrokodillen  < 1 m0021",64.75,"Uitheems","Krokodillen  < 1 m",21,35,64.75,"UitheemsKrokodillen  < 1 m"]
[242,"UitheemsKrokodillen  < 1 m0036",92.5,"Uitheems","Krokodillen  < 1 m",36,50,92.5,"UitheemsKrokodillen  < 1 m"]
[243,"UitheemsKrokodillen  < 1 m0051",138.75,"Uitheems","Krokodillen  < 1 m",51,75,138.75,"UitheemsKrokodillen  < 1 m"]
[244,"UitheemsKrokodillen  < 1 m0076",185,"Uitheems","Krokodillen  < 1 m",76,100,185,"UitheemsKrokodillen  < 1 m"]
[245,"UitheemsKrokodillen  < 1 m0101",231.25,"Uitheems","Krokodillen  < 1 m",101,125,231.25,"UitheemsKrokodillen  < 1 m"]
[246,"UitheemsKrokodillen  < 1 m0126",277.5,"Uitheems","Krokodillen  < 1 m",126,150,277.5,"UitheemsKrokodillen  < 1 m"]
[247,"UitheemsKrokodillen  < 1 m0151",323.75,"Uitheems","Krokodillen  < 1 m",151,175,323.75,"UitheemsKrokodillen  < 1 m"]
[248,"UitheemsKrokodillen  < 1 m0176",370,"Uitheems","Krokodillen  < 1 m",176,200,370,"UitheemsKrokodillen  < 1 m"]
[249,"UitheemsKrokodillen  < 1 m0201",425.5,"Uitheems","Krokodillen  < 1 m",201,230,425.5,"UitheemsKrokodillen  < 1 m"]
[250,"UitheemsKrokodillen  < 1 m0231",481,"Uitheems","Krokodillen  < 1 m",231,260,481,"UitheemsKrokodillen  < 1 m"]
[251,"UitheemsKrokodillen  < 1 m0261",555,"Uitheems","Krokodillen  < 1 m",261,300,555,"UitheemsKrokodillen  < 1 m"]
[252,"UitheemsKrokodillen  > 1 m0001",4.1399999999999997,"Uitheems","Krokodillen  > 1 m",1,2,4.1399999999999997,"UitheemsKrokodillen  > 1 m"]
[253,"UitheemsKrokodillen  > 1 m0003",10.35,"Uitheems","Krokodillen  > 1 m",3,5,10.35,"UitheemsKrokodillen  > 1 m"]
[254,"UitheemsKrokodillen  > 1 m0006",18.63,"Uitheems","Krokodillen  > 1 m",6,9,18.63,"UitheemsKrokodillen  > 1 m"]
[255,"UitheemsKrokodillen  > 1 m0010",31.049999999999997,"Uitheems","Krokodillen  > 1 m",10,15,31.049999999999997,"UitheemsKrokodillen  > 1 m"]
[256,"UitheemsKrokodillen  > 1 m0016",41.4,"Uitheems","Krokodillen  > 1 m",16,20,41.4,"UitheemsKrokodillen  > 1 m"]
[257,"UitheemsKrokodillen  > 1 m0021",51.749999999999993,"Uitheems","Krokodillen  > 1 m",21,25,51.749999999999993,"UitheemsKrokodillen  > 1 m"]
[258,"UitheemsKrokodillen  > 1 m0026",62.099999999999994,"Uitheems","Krokodillen  > 1 m",26,30,62.099999999999994,"UitheemsKrokodillen  > 1 m"]
[259,"UitheemsKrokodillen  > 1 m0031",72.449999999999989,"Uitheems","Krokodillen  > 1 m",31,35,72.449999999999989,"UitheemsKrokodillen  > 1 m"]
[260,"UitheemsKrokodillen  > 1 m0036",82.8,"Uitheems","Krokodillen  > 1 m",36,40,82.8,"UitheemsKrokodillen  > 1 m"]
[261,"UitheemsKrokodillen  > 1 m0041",93.149999999999991,"Uitheems","Krokodillen  > 1 m",41,45,93.149999999999991,"UitheemsKrokodillen  > 1 m"]
[262,"UitheemsKrokodillen  > 1 m0046",103.49999999999999,"Uitheems","Krokodillen  > 1 m",46,50,103.49999999999999,"UitheemsKrokodillen  > 1 m"]
[263,{"$f":"D322&E322&TEXT(F322,\"0000\")","v":"UitheemsKrokodillen  > 1 m0051"},{"$f":"H322","v":113.85},"Uitheems","Krokodillen  > 1 m",51,55,113.85,{"$f":"D322&E322","v":"UitheemsKrokodillen  > 1 m"}]
[264,"UitheemsKrokodillen  > 1 m0056",124.19999999999999,"Uitheems","Krokodillen  > 1 m",56,60,124.19999999999999,"UitheemsKrokodillen  > 1 m"]
[265,"UitheemsKrokodillen  > 1 m0061",134.54999999999998,"Uitheems","Krokodillen  > 1 m",61,65,134.54999999999998,"UitheemsKrokodillen  > 1 m"]
[276,"UitheemsLandschildpadden0001",4.32,"Uitheems","Landschildpadden",1,3,4.32,"UitheemsLandschildpadden"]
[277,"UitheemsLandschildpadden0004",10.08,"Uitheems","Landschildpadden",4,7,10.08,"UitheemsLandschildpadden"]
[278,"UitheemsLandschildpadden0008",14.399999999999999,"Uitheems","Landschildpadden",8,10,14.399999999999999,"UitheemsLandschildpadden"]
[279,"UitheemsLandschildpadden0010",17.28,"Uitheems","Landschildpadden",10,12,17.28,"UitheemsLandschildpadden"]
[280,"UitheemsLandschildpadden0013",21.599999999999998,"Uitheems","Landschildpadden",13,15,21.599999999999998,"UitheemsLandschildpadden"]
[281,"UitheemsLandschildpadden0016",25.919999999999998,"Uitheems","Landschildpadden",16,18,25.919999999999998,"UitheemsLandschildpadden"]
[282,"UitheemsLandschildpadden0019",30.24,"Uitheems","Landschildpadden",19,21,30.24,"UitheemsLandschildpadden"]
[283,"UitheemsLandschildpadden0022",34.56,"Uitheems","Landschildpadden",22,24,34.56,"UitheemsLandschildpadden"]
[284,"UitheemsLandschildpadden0025",38.879999999999995,"Uitheems","Landschildpadden",25,27,38.879999999999995,"UitheemsLandschildpadden"]
[285,"UitheemsLandschildpadden0028",43.199999999999996,"Uitheems","Landschildpadden",28,30,43.199999999999996,"UitheemsLandschildpadden"]
[36,"UitheemsPapegaaien0001",1.5,"Uitheems","Papegaaien",1,2,1.5,"UitheemsPapegaaien"]
[37,"UitheemsPapegaaien0003",3,"Uitheems","Papegaaien",3,4,3,"UitheemsPapegaaien"]
[38,"UitheemsPapegaaien0005",4.5,"Uitheems","Papegaaien",5,6,4.5,"UitheemsPapegaaien"]
[39,"UitheemsPapegaaien0007",6,"Uitheems","Papegaaien",7,8,6,"UitheemsPapegaaien"]
[40,"UitheemsPapegaaien0009",7.5,"Uitheems","Papegaaien",9,10,7.5,"UitheemsPapegaaien"]
[41,"UitheemsPapegaaien0011",9,"Uitheems","Papegaaien",11,12,9,"UitheemsPapegaaien"]
[42,"UitheemsPapegaaien0012",10.5,"Uitheems","Papegaaien",12,14,10.5,"UitheemsPapegaaien"]
[43,"UitheemsPapegaaien0015",12,"Uitheems","Papegaaien",15,16,12,"UitheemsPapegaaien"]
[44,"UitheemsPapegaaien0017",13.5,"Uitheems","Papegaaien",17,18,13.5,"UitheemsPapegaaien"]
[45,"UitheemsPapegaaien0019",15,"Uitheems","Papegaaien",19,20,15,"UitheemsPapegaaien"]
[46,"UitheemsPapegaaien0021",16.5,"Uitheems","Papegaaien",21,22,16.5,"UitheemsPapegaaien"]
[47,"UitheemsPapegaaien0023",18,"Uitheems","Papegaaien",23,24,18,"UitheemsPapegaaien"]
[48,"UitheemsPapegaaien0025",19.5,"Uitheems","Papegaaien",25,26,19.5,"UitheemsPapegaaien"]
[49,"UitheemsPapegaaien0027",21,"Uitheems","Papegaaien",27,28,21,"UitheemsPapegaaien"]
[183,"UitheemsPrimaten groot0001",9.36,"Uitheems","Primaten groot",1,1,9.36,"UitheemsPrimaten groot"]
[184,"UitheemsPrimaten groot0002",18.72,"Uitheems","Primaten groot",2,2,{"$f":"G350*9.36","v":18.72},"UitheemsPrimaten groot"]
[185,"UitheemsPrimaten groot0003",28.08,"Uitheems","Primaten groot",3,3,28.08,"UitheemsPrimaten groot"]
[186,"UitheemsPrimaten groot0004",37.44,"Uitheems","Primaten groot",4,4,37.44,"UitheemsPrimaten groot"]
[187,"UitheemsPrimaten groot0005",46.8,"Uitheems","Primaten groot",5,5,46.8,"UitheemsPrimaten groot"]
[188,"UitheemsPrimaten groot0006",56.16,"Uitheems","Primaten groot",6,6,56.16,"UitheemsPrimaten groot"]
[189,"UitheemsPrimaten groot0007",65.52,"Uitheems","Primaten groot",7,7,65.52,"UitheemsPrimaten groot"]
[161,"UitheemsPrimaten klein0001",3.65,"Uitheems","Primaten klein",1,1,3.65,"UitheemsPrimaten klein"]
[162,"UitheemsPrimaten klein0002",7.3,"Uitheems","Primaten klein",2,2,{"$f":"G357*3.65","v":7.3},"UitheemsPrimaten klein"]
[163,"UitheemsPrimaten klein0003",10.95,"Uitheems","Primaten klein",3,3,10.95,"UitheemsPrimaten klein"]
[164,"UitheemsPrimaten klein0004",14.6,"Uitheems","Primaten klein",4,4,14.6,"UitheemsPrimaten klein"]
[165,"UitheemsPrimaten klein0005",18.25,"Uitheems","Primaten klein",5,5,18.25,"UitheemsPrimaten klein"]
[166,"UitheemsPrimaten klein0006",21.9,"Uitheems","Primaten klein",6,6,21.9,"UitheemsPrimaten klein"]
[167,"UitheemsPrimaten klein0007",25.55,"Uitheems","Primaten klein",7,7,25.55,"UitheemsPrimaten klein"]
[168,"UitheemsPrimaten klein0008",29.2,"Uitheems","Primaten klein",8,8,29.2,"UitheemsPrimaten klein"]
[169,"UitheemsPrimaten klein0009",32.85,"Uitheems","Primaten klein",9,9,32.85,"UitheemsPrimaten klein"]
[170,"UitheemsPrimaten klein0010",36.5,"Uitheems","Primaten klein",10,10,36.5,"UitheemsPrimaten klein"]
[171,"UitheemsPrimaten klein0011",40.15,"Uitheems","Primaten klein",11,11,40.15,"UitheemsPrimaten klein"]
[172,"UitheemsPrimaten klein0012",43.8,"Uitheems","Primaten klein",12,12,43.8,"UitheemsPrimaten klein"]
[173,"UitheemsPrimaten klein0013",47.449999999999996,"Uitheems","Primaten klein",13,13,47.449999999999996,"UitheemsPrimaten klein"]
[174,"UitheemsPrimaten klein0014",51.1,"Uitheems","Primaten klein",14,14,51.1,"UitheemsPrimaten klein"]
[175,"UitheemsPrimaten klein0015",54.75,"Uitheems","Primaten klein",15,15,54.75,"UitheemsPrimaten klein"]
[176,"UitheemsPrimaten middel0001",6.22,"Uitheems","Primaten middel",1,1,6.22,"UitheemsPrimaten middel"]
[177,"UitheemsPrimaten middel0002",12.44,"Uitheems","Primaten middel",2,2,{"$f":"G372*6.22","v":12.44},"UitheemsPrimaten middel"]
[178,"UitheemsPrimaten middel0003",18.66,"Uitheems","Primaten middel",3,3,18.66,"UitheemsPrimaten middel"]
[179,"UitheemsPrimaten middel0004",24.88,"Uitheems","Primaten middel",4,4,24.88,"UitheemsPrimaten middel"]
[180,"UitheemsPrimaten middel0005",31.099999999999998,"Uitheems","Primaten middel",5,5,31.099999999999998,"UitheemsPrimaten middel"]
[181,"UitheemsPrimaten middel0006",37.32,"Uitheems","Primaten middel",6,6,37.32,"UitheemsPrimaten middel"]
[182,"UitheemsPrimaten middel0007",43.54,"Uitheems","Primaten middel",7,7,43.54,"UitheemsPrimaten middel"]
[190,"UitheemsPrimaten zeer groot0001",13.94,"Uitheems","Primaten zeer groot",1,1,13.94,"UitheemsPrimaten zeer groot"]
[191,"UitheemsPrimaten zeer groot0002",27.88,"Uitheems","Primaten zeer groot",2,2,{"$f":"G379*13.94","v":27.88},"UitheemsPrimaten zeer groot"]
[192,"UitheemsPrimaten zeer groot0003",41.82,"Uitheems","Primaten zeer groot",3,3,{"$f":"G380*13.94","v":41.82},"UitheemsPrimaten zeer groot"]
[193,"UitheemsPrimaten zeer groot0004",55.76,"Uitheems","Primaten zeer groot",4,4,{"$f":"G381*13.94","v":55.76},"UitheemsPrimaten zeer groot"]
[194,"UitheemsPrimaten zeer groot0005",69.7,"Uitheems","Primaten zeer groot",5,5,{"$f":"G382*13.94","v":69.7},"UitheemsPrimaten zeer groot"]
[195,"UitheemsPrimaten zeer groot0006",83.64,"Uitheems","Primaten zeer groot",6,6,{"$f":"G383*13.94","v":83.64},"UitheemsPrimaten zeer groot"]
[64,"UitheemsRoofvogels (categorie A+B)0001",9.33,"Uitheems","Roofvogels (categorie A+B)",1,3,9.33,"UitheemsRoofvogels (categorie A+B)"]
[65,"UitheemsRoofvogels (categorie A+B)0004",18.66,"Uitheems","Roofvogels (categorie A+B)",4,6,18.66,"UitheemsRoofvogels (categorie A+B)"]
[66,{"$f":"D386&E386&TEXT(F386,\"0000\")","v":"UitheemsRoofvogels (categorie A+B)0007"},{"$f":"H386","v":27.99},"Uitheems","Roofvogels (categorie A+B)",7,9,27.99,{"$f":"D386&E386","v":"UitheemsRoofvogels (categorie A+B)"}]
[67,"UitheemsRoofvogels (categorie A+B)0010",37.32,"Uitheems","Roofvogels (categorie A+B)",10,12,37.32,"UitheemsRoofvogels (categorie A+B)"]
[68,"UitheemsRoofvogels (categorie A+B)0013",46.65,"Uitheems","Roofvogels (categorie A+B)",13,15,46.65,"UitheemsRoofvogels (categorie A+B)"]
[69,"UitheemsRoofvogels (categorie C)0001",12.600000000000001,"Uitheems","Roofvogels (categorie C)",1,3,12.600000000000001,"UitheemsRoofvogels (categorie C)"]
[70,"UitheemsRoofvogels (categorie C)0004",25.200000000000003,"Uitheems","Roofvogels (categorie C)",4,6,25.200000000000003,"UitheemsRoofvogels (categorie C)"]
[71,"UitheemsRoofvogels (categorie C)0007",37.800000000000004,"Uitheems","Roofvogels (categorie C)",7,9,37.800000000000004,"UitheemsRoofvogels (categorie C)"]
[72,"UitheemsRoofvogels (categorie C)0010",50.400000000000006,"Uitheems","Roofvogels (categorie C)",10,12,50.400000000000006,"UitheemsRoofvogels (categorie C)"]
[73,"UitheemsRoofvogels (categorie C)0013",63,"Uitheems","Roofvogels (categorie C)",13,15,63,"UitheemsRoofvogels (categorie C)"]
[74,"UitheemsRoofvogels (categorie D)0001",14.399999999999999,"Uitheems","Roofvogels (categorie D)",1,3,14.399999999999999,"UitheemsRoofvogels (categorie D)"]
[75,"UitheemsRoofvogels (categorie D)0004",28.799999999999997,"Uitheems","Roofvogels (categorie D)",4,6,28.799999999999997,"UitheemsRoofvogels (categorie D)"]
[76,"UitheemsRoofvogels (categorie D)0007",43.199999999999996,"Uitheems","Roofvogels (categorie D)",7,9,43.199999999999996,"UitheemsRoofvogels (categorie D)"]
[77,"UitheemsRoofvogels (categorie D)0010",57.599999999999994,"Uitheems","Roofvogels (categorie D)",10,12,57.599999999999994,"UitheemsRoofvogels (categorie D)"]
[78,"UitheemsRoofvogels (categorie D)0013",72,"Uitheems","Roofvogels (categorie D)",13,15,72,"UitheemsRoofvogels (categorie D)"]
[79,"UitheemsRoofvogels (categorie E)0001",15.600000000000001,"Uitheems","Roofvogels (categorie E)",1,3,15.600000000000001,"UitheemsRoofvogels (categorie E)"]
[80,"UitheemsRoofvogels (categorie E)0004",31.200000000000003,"Uitheems","Roofvogels (categorie E)",4,6,31.200000000000003,"UitheemsRoofvogels (categorie E)"]
[81,"UitheemsRoofvogels (categorie E)0007",46.800000000000004,"Uitheems","Roofvogels (categorie E)",7,9,46.800000000000004,"UitheemsRoofvogels (categorie E)"]
[82,"UitheemsRoofvogels (categorie E)0010",62.400000000000006,"Uitheems","Roofvogels (categorie E)",10,12,62.400000000000006,"UitheemsRoofvogels (categorie E)"]
[83,"UitheemsRoofvogels (categorie E)0013",78,"Uitheems","Roofvogels (categorie E)",13,15,78,"UitheemsRoofvogels (categorie E)"]
[84,"UitheemsRoofvogels (categorie F)0001",18.899999999999999,"Uitheems","Roofvogels (categorie F)",1,3,18.899999999999999,"UitheemsRoofvogels (categorie F)"]
[85,"UitheemsRoofvogels (categorie F)0004",37.799999999999997,"Uitheems","Roofvogels (categorie F)",4,6,37.799999999999997,"UitheemsRoofvogels (categorie F)"]
[86,"UitheemsRoofvogels (categorie F)0007",56.699999999999996,"Uitheems","Roofvogels (categorie F)",7,9,56.699999999999996,"UitheemsRoofvogels (categorie F)"]
[87,"UitheemsRoofvogels (categorie F)0010",75.599999999999994,"Uitheems","Roofvogels (categorie F)",10,12,75.599999999999994,"UitheemsRoofvogels (categorie F)"]
[88,"UitheemsRoofvogels (categorie F)0013",94.5,"Uitheems","Roofvogels (categorie F)",13,15,94.5,"UitheemsRoofvogels (categorie F)"]
[296,"UitheemsSlangen < 1m0001",3.64,"Uitheems","Slangen < 1m",1,2,3.64,"UitheemsSlangen < 1m"]
[297,"UitheemsSlangen < 1m0003",7.28,"Uitheems","Slangen < 1m",3,4,7.28,"UitheemsSlangen < 1m"]
[298,"UitheemsSlangen < 1m0005",10.92,"Uitheems","Slangen < 1m",5,6,10.92,"UitheemsSlangen < 1m"]
[299,"UitheemsSlangen < 1m0007",14.56,"Uitheems","Slangen < 1m",7,8,14.56,"UitheemsSlangen < 1m"]
[300,"UitheemsSlangen < 1m0009",18.2,"Uitheems","Slangen < 1m",9,10,18.2,"UitheemsSlangen < 1m"]
[301,"UitheemsSlangen < 1m0011",21.84,"Uitheems","Slangen < 1m",11,12,21.84,"UitheemsSlangen < 1m"]
[302,"UitheemsSlangen < 1m0013",25.48,"Uitheems","Slangen < 1m",13,14,25.48,"UitheemsSlangen < 1m"]
[303,"UitheemsSlangen < 1m0015",29.12,"Uitheems","Slangen < 1m",15,16,29.12,"UitheemsSlangen < 1m"]
[304,"UitheemsSlangen < 1m0017",32.76,"Uitheems","Slangen < 1m",17,18,32.76,"UitheemsSlangen < 1m"]
[305,"UitheemsSlangen < 1m0019",36.4,"Uitheems","Slangen < 1m",19,20,36.4,"UitheemsSlangen < 1m"]
[306,"UitheemsSlangen > 1m0001",4.58,"Uitheems","Slangen > 1m",1,2,4.58,"UitheemsSlangen > 1m"]
[307,"UitheemsSlangen > 1m0003",9.16,"Uitheems","Slangen > 1m",3,4,9.16,"UitheemsSlangen > 1m"]
[308,"UitheemsSlangen > 1m0005",13.74,"Uitheems","Slangen > 1m",5,6,13.74,"UitheemsSlangen > 1m"]
[309,"UitheemsSlangen > 1m0007",18.32,"Uitheems","Slangen > 1m",7,8,18.32,"UitheemsSlangen > 1m"]
[310,"UitheemsSlangen > 1m0009",22.9,"Uitheems","Slangen > 1m",9,10,22.9,"UitheemsSlangen > 1m"]
[311,"UitheemsSlangen > 1m0011",27.48,"Uitheems","Slangen > 1m",11,12,27.48,"UitheemsSlangen > 1m"]
[312,"UitheemsSlangen > 1m0013",32.06,"Uitheems","Slangen > 1m",13,14,32.06,"UitheemsSlangen > 1m"]
[313,"UitheemsSlangen > 1m0015",36.64,"Uitheems","Slangen > 1m",15,16,36.64,"UitheemsSlangen > 1m"]
[314,"UitheemsSlangen > 1m0017",41.22,"Uitheems","Slangen > 1m",17,18,41.22,"UitheemsSlangen > 1m"]
[315,"UitheemsSlangen > 1m0019",45.8,"Uitheems","Slangen > 1m",19,20,45.8,"UitheemsSlangen > 1m"]
[29,"UitheemsUitheemse vogels - groot0001",10.06,"Uitheems","Uitheemse vogels - groot",1,2,10.06,"UitheemsUitheemse vogels - groot"]
[30,"UitheemsUitheemse vogels - groot0003",25.150000000000002,"Uitheems","Uitheemse vogels - groot",3,5,25.150000000000002,"UitheemsUitheemse vogels - groot"]
[31,"UitheemsUitheemse vogels - groot0006",50.300000000000004,"Uitheems","Uitheemse vogels - groot",6,10,50.300000000000004,"UitheemsUitheemse vogels - groot"]
[32,"UitheemsUitheemse vogels - groot0011",75.45,"Uitheems","Uitheemse vogels - groot",11,15,75.45,"UitheemsUitheemse vogels - groot"]
[33,"UitheemsUitheemse vogels - groot0015",100.60000000000001,"Uitheems","Uitheemse vogels - groot",15,20,100.60000000000001,"UitheemsUitheemse vogels - groot"]
[34,"UitheemsUitheemse vogels - groot0020",150.9,"Uitheems","Uitheemse vogels - groot",20,30,150.9,"UitheemsUitheemse vogels - groot"]
[35,"UitheemsUitheemse vogels - groot0030",201.20000000000002,"Uitheems","Uitheemse vogels - groot",30,40,201.20000000000002,"UitheemsUitheemse vogels - groot"]
[1,"UitheemsUitheemse vogels - klein0001",1.7,"Uitheems","Uitheemse vogels - klein",1,5,1.7,"UitheemsUitheemse vogels - klein"]
[2,"UitheemsUitheemse vogels - klein0006",5.1000000000000005,"Uitheems","Uitheemse vogels - klein",6,15,5.1000000000000005,"UitheemsUitheemse vogels - klein",null,null,null,null,"Papegaaien"]
[3,"UitheemsUitheemse vogels - klein0016",11.9,"Uitheems","Uitheemse vogels - klein",16,35,11.9,"UitheemsUitheemse vogels - klein",null,null,null,null,4]
[4,"UitheemsUitheemse vogels - klein0036",18.700000000000003,"Uitheems","Uitheemse vogels - klein",36,55,18.700000000000003,"UitheemsUitheemse vogels - klein",null,null,null,null,{"$f":"SUMIFS(H:H,D:D,N435,E:E,N437,F:F,\"<=\"&N438,G:G,\">=\"&N438)","v":0}]
[5,"UitheemsUitheemse vogels - klein0051",25.500000000000004,"Uitheems","Uitheemse vogels - klein",51,75,25.500000000000004,"UitheemsUitheemse vogels - klein"]
[6,"UitheemsUitheemse vogels - klein0076",34,"Uitheems","Uitheemse vogels - klein",76,100,34,"UitheemsUitheemse vogels - klein"]
[7,"UitheemsUitheemse vogels - klein0101",51,"Uitheems","Uitheemse vogels - klein",101,150,51,"UitheemsUitheemse vogels - klein"]
[8,"UitheemsUitheemse vogels - klein0151",67,"Uitheems","Uitheemse vogels - klein",151,200,67,"UitheemsUitheemse vogels - klein"]
[9,"UitheemsUitheemse vogels - klein0201",84,"Uitheems","Uitheemse vogels - klein",201,250,84,"UitheemsUitheemse vogels - klein"]
[10,"UitheemsUitheemse vogels - klein0251",103,"Uitheems","Uitheemse vogels - klein",251,300,103,"UitheemsUitheemse vogels - klein"]
[11,"UitheemsUitheemse vogels - klein0301",118,"Uitheems","Uitheemse vogels - klein",301,350,118,"UitheemsUitheemse vogels - klein"]
[12,"UitheemsUitheemse vogels - klein0351",134,"Uitheems","Uitheemse vogels - klein",351,400,134,"UitheemsUitheemse vogels - klein"]
[13,"UitheemsUitheemse vogels - klein0401",152,"Uitheems","Uitheemse vogels - klein",401,450,152,"UitheemsUitheemse vogels - klein"]
[14,"UitheemsUitheemse vogels - klein0451",169,"Uitheems","Uitheemse vogels - klein",451,500,169,"UitheemsUitheemse vogels - klein"]
[15,{"$f":"D450&E450&TEXT(F450,\"0000\")","v":"UitheemsUitheemse vogels - middel0001"},{"$f":"H450","v":3.75},"Uitheems","Uitheemse vogels - middel",1,5,3.75,{"$f":"D450&E450","v":"UitheemsUitheemse vogels - middel"}]
[16,"UitheemsUitheemse vogels - middel0006",11.25,"Uitheems","Uitheemse vogels - middel",6,15,11.25,"UitheemsUitheemse vogels - middel"]
[17,"UitheemsUitheemse vogels - middel0016",26.25,"Uitheems","Uitheemse vogels - middel",16,35,26.25,"UitheemsUitheemse vogels - middel"]
[18,"UitheemsUitheemse vogels - middel0036",41.25,"Uitheems","Uitheemse vogels - middel",36,55,41.25,"UitheemsUitheemse vogels - middel"]
[19,"UitheemsUitheemse vogels - middel0051",56.25,"Uitheems","Uitheemse vogels - middel",51,75,56.25,"UitheemsUitheemse vogels - middel"]
[20,"UitheemsUitheemse vogels - middel0076",75,"Uitheems","Uitheemse vogels - middel",76,100,75,"UitheemsUitheemse vogels - middel"]
[21,"UitheemsUitheemse vogels - middel0101",112.5,"Uitheems","Uitheemse vogels - middel",101,150,112.5,"UitheemsUitheemse vogels - middel"]
[22,"UitheemsUitheemse vogels - middel0151",150,"Uitheems","Uitheemse vogels - middel",151,200,150,"UitheemsUitheemse vogels - middel"]
[23,"UitheemsUitheemse vogels - middel0201",187.5,"Uitheems","Uitheemse vogels - middel",201,250,187.5,"UitheemsUitheemse vogels - middel"]
[24,"UitheemsUitheemse vogels - middel0251",225,"Uitheems","Uitheemse vogels - middel",251,300,225,"UitheemsUitheemse vogels - middel"]
[25,"UitheemsUitheemse vogels - middel0301",262.5,"Uitheems","Uitheemse vogels - middel",301,350,262.5,"UitheemsUitheemse vogels - middel"]
[26,"UitheemsUitheemse vogels - middel0351",300,"Uitheems","Uitheemse vogels - middel",351,400,300,"UitheemsUitheemse vogels - middel"]
[27,"UitheemsUitheemse vogels - middel0401",337.5,"Uitheems","Uitheemse vogels - middel",401,450,337.5,"UitheemsUitheemse vogels - middel"]
[28,"UitheemsUitheemse vogels - middel0451",375,"Uitheems","Uitheemse vogels - middel",451,500,375,"UitheemsUitheemse vogels - middel"]
[346,"UitheemsVissen > 200 gram0001",8.6999999999999993,"Uitheems","Vissen > 200 gram",1,5,8.6999999999999993,"UitheemsVissen > 200 gram"]
[347,"UitheemsVissen > 200 gram0006",26.1,"Uitheems","Vissen > 200 gram",6,15,26.1,"UitheemsVissen > 200 gram"]
[348,"UitheemsVissen > 200 gram0016",60.9,"Uitheems","Vissen > 200 gram",16,35,60.9,"UitheemsVissen > 200 gram"]
[349,"UitheemsVissen > 200 gram0036",95.7,"Uitheems","Vissen > 200 gram",36,55,95.7,"UitheemsVissen > 200 gram"]
[350,"UitheemsVissen > 200 gram0051",130.5,"Uitheems","Vissen > 200 gram",51,75,130.5,"UitheemsVissen > 200 gram"]
[351,"UitheemsVissen > 200 gram0076",174,"Uitheems","Vissen > 200 gram",76,100,174,"UitheemsVissen > 200 gram"]
[352,"UitheemsVissen > 200 gram0101",261,"Uitheems","Vissen > 200 gram",101,150,261,"UitheemsVissen > 200 gram"]
[353,"UitheemsVissen > 200 gram0151",348,"Uitheems","Vissen > 200 gram",151,200,348,"UitheemsVissen > 200 gram"]
[354,"UitheemsVissen > 200 gram0201",435,"Uitheems","Vissen > 200 gram",201,250,435,"UitheemsVissen > 200 gram"]
[355,"UitheemsVissen > 200 gram0251",522,"Uitheems","Vissen > 200 gram",251,300,522,"UitheemsVissen > 200 gram"]
[326,"UitheemsVissen 0-100 gram0001",4.0999999999999996,"Uitheems","Vissen 0-100 gram",1,5,4.0999999999999996,"UitheemsVissen 0-100 gram"]
[327,"UitheemsVissen 0-100 gram0006",12.299999999999999,"Uitheems","Vissen 0-100 gram",6,15,12.299999999999999,"UitheemsVissen 0-100 gram"]
[328,"UitheemsVissen 0-100 gram0016",28.7,"Uitheems","Vissen 0-100 gram",16,35,28.7,"UitheemsVissen 0-100 gram"]
[329,"UitheemsVissen 0-100 gram0036",45.099999999999994,"Uitheems","Vissen 0-100 gram",36,55,45.099999999999994,"UitheemsVissen 0-100 gram"]
[330,"UitheemsVissen 0-100 gram0051",61.499999999999993,"Uitheems","Vissen 0-100 gram",51,75,61.499999999999993,"UitheemsVissen 0-100 gram"]
[331,"UitheemsVissen 0-100 gram0076",82,"Uitheems","Vissen 0-100 gram",76,100,82,"UitheemsVissen 0-100 gram"]
[332,"UitheemsVissen 0-100 gram0101",122.99999999999999,"Uitheems","Vissen 0-100 gram",101,150,122.99999999999999,"UitheemsVissen 0-100 gram"]
[333,"UitheemsVissen 0-100 gram0151",164,"Uitheems","Vissen 0-100 gram",151,200,164,"UitheemsVissen 0-100 gram"]
[334,"UitheemsVissen 0-100 gram0201",205,"Uitheems","Vissen 0-100 gram",201,250,205,"UitheemsVissen 0-100 gram"]
[335,"UitheemsVissen 0-100 gram0251",245.99999999999997,"Uitheems","Vissen 0-100 gram",251,300,245.99999999999997,"UitheemsVissen 0-100 gram"]
[336,"UitheemsVissen 100-200 gram0001",5.6000000000000005,"Uitheems","Vissen 100-200 gram",1,5,5.6000000000000005,"UitheemsVissen 100-200 gram"]
[337,"UitheemsVissen 100-200 gram0006",16.8,"Uitheems","Vissen 100-200 gram",6,15,16.8,"UitheemsVissen 100-200 gram"]
[338,"UitheemsVissen 100-200 gram0016",39.200000000000003,"Uitheems","Vissen 100-200 gram",16,35,39.200000000000003,"UitheemsVissen 100-200 gram"]
[339,"UitheemsVissen 100-200 gram0036",61.600000000000009,"Uitheems","Vissen 100-200 gram",36,55,61.600000000000009,"UitheemsVissen 100-200 gram"]
[340,"UitheemsVissen 100-200 gram0051",84.000000000000014,"Uitheems","Vissen 100-200 gram",51,75,84.000000000000014,"UitheemsVissen 100-200 gram"]
[341,"UitheemsVissen 100-200 gram0076",112.00000000000001,"Uitheems","Vissen 100-200 gram",76,100,112.00000000000001,"UitheemsVissen 100-200 gram"]
[342,"UitheemsVissen 100-200 gram0101",168.00000000000003,"Uitheems","Vissen 100-200 gram",101,150,168.00000000000003,"UitheemsVissen 100-200 gram"]
[343,"UitheemsVissen 100-200 gram0151",224.00000000000003,"Uitheems","Vissen 100-200 gram",151,200,224.00000000000003,"UitheemsVissen 100-200 gram"]
[344,"UitheemsVissen 100-200 gram0201",280,"Uitheems","Vissen 100-200 gram",201,250,280,"UitheemsVissen 100-200 gram"]
[345,"UitheemsVissen 100-200 gram0251",336.00000000000006,"Uitheems","Vissen 100-200 gram",251,300,336.00000000000006,"UitheemsVissen 100-200 gram"]
[266,"UitheemsWaterschildpadden0001",6.2099999999999991,"Uitheems","Waterschildpadden",1,3,6.2099999999999991,"UitheemsWaterschildpadden"]
[267,"UitheemsWaterschildpadden0004",14.489999999999998,"Uitheems","Waterschildpadden",4,7,14.489999999999998,"UitheemsWaterschildpadden"]
[268,"UitheemsWaterschildpadden0008",20.7,"Uitheems","Waterschildpadden",8,10,20.7,"UitheemsWaterschildpadden"]
[269,"UitheemsWaterschildpadden0010",24.839999999999996,"Uitheems","Waterschildpadden",10,12,24.839999999999996,"UitheemsWaterschildpadden"]
[270,"UitheemsWaterschildpadden0013",31.049999999999997,"Uitheems","Waterschildpadden",13,15,31.049999999999997,"UitheemsWaterschildpadden"]
[271,"UitheemsWaterschildpadden0016",37.26,"Uitheems","Waterschildpadden",16,18,37.26,"UitheemsWaterschildpadden"]
[272,"UitheemsWaterschildpadden0019",43.47,"Uitheems","Waterschildpadden",19,21,43.47,"UitheemsWaterschildpadden"]
[273,"UitheemsWaterschildpadden0022",49.679999999999993,"Uitheems","Waterschildpadden",22,24,49.679999999999993,"UitheemsWaterschildpadden"]
[274,"UitheemsWaterschildpadden0025",55.889999999999993,"Uitheems","Waterschildpadden",25,27,55.889999999999993,"UitheemsWaterschildpadden"]
[275,"UitheemsWaterschildpadden0028",62.099999999999994,"Uitheems","Waterschildpadden",28,30,62.099999999999994,"UitheemsWaterschildpadden"]
[123,"UitheemsZoogdieren - groot0001",19.260000000000002,"Uitheems","Zoogdieren - groot",1,2,19.260000000000002,"UitheemsZoogdieren - groot"]
[124,"UitheemsZoogdieren - groot0003",48.150000000000006,"Uitheems","Zoogdieren - groot",3,5,48.150000000000006,"UitheemsZoogdieren - groot"]
[125,"UitheemsZoogdieren - groot0006",96.300000000000011,"Uitheems","Zoogdieren - groot",6,10,96.300000000000011,"UitheemsZoogdieren - groot"]
[126,"UitheemsZoogdieren - groot0011",144.45000000000002,"Uitheems","Zoogdieren - groot",11,15,144.45000000000002,"UitheemsZoogdieren - groot"]
[127,"UitheemsZoogdieren - groot0016",240.75000000000003,"Uitheems","Zoogdieren - groot",16,25,240.75000000000003,"UitheemsZoogdieren - groot"]
[128,"UitheemsZoogdieren - groot0026",337.05,"Uitheems","Zoogdieren - groot",26,35,337.05,"UitheemsZoogdieren - groot"]
[129,"UitheemsZoogdieren - groot0036",481.50000000000006,"Uitheems","Zoogdieren - groot",36,50,481.50000000000006,"UitheemsZoogdieren - groot"]
[130,"UitheemsZoogdieren - groot0051",674.1,"Uitheems","Zoogdieren - groot",51,70,674.1,"UitheemsZoogdieren - groot"]
[131,"UitheemsZoogdieren - groot0071",963.00000000000011,"Uitheems","Zoogdieren - groot",71,100,963.00000000000011,"UitheemsZoogdieren - groot"]
[132,"UitheemsZoogdieren - groot0101",1444.5000000000002,"Uitheems","Zoogdieren - groot",101,150,1444.5000000000002,"UitheemsZoogdieren - groot"]
[133,{"$f":"D514&E514&TEXT(F514,\"0000\")","v":"UitheemsZoogdieren - groot0151"},{"$f":"H514","v":1926.0000000000002},"Uitheems","Zoogdieren - groot",151,200,1926.0000000000002,{"$f":"D514&E514","v":"UitheemsZoogdieren - groot"}]
[134,"UitheemsZoogdieren - groot0201",2407.5,"Uitheems","Zoogdieren - groot",201,250,2407.5,"UitheemsZoogdieren - groot"]
[135,"UitheemsZoogdieren - groot0251",2889.0000000000005,"Uitheems","Zoogdieren - groot",251,300,2889.0000000000005,"UitheemsZoogdieren - groot"]
[136,"UitheemsZoogdieren - groot0301",3370.5000000000005,"Uitheems","Zoogdieren - groot",301,350,3370.5000000000005,"UitheemsZoogdieren - groot"]
[137,"UitheemsZoogdieren - groot0351",3852.0000000000005,"Uitheems","Zoogdieren - groot",351,400,3852.0000000000005,"UitheemsZoogdieren - groot"]
[95,"UitheemsZoogdieren - klein0001",5.9399999999999995,"Uitheems","Zoogdieren - klein",1,3,5.9399999999999995,"UitheemsZoogdieren - klein"]
[96,"UitheemsZoogdieren - klein0004",19.8,"Uitheems","Zoogdieren - klein",4,10,19.8,"UitheemsZoogdieren - klein"]
[97,"UitheemsZoogdieren - klein0011",39.6,"Uitheems","Zoogdieren - klein",11,20,39.6,"UitheemsZoogdieren - klein"]
[98,"UitheemsZoogdieren - klein0021",69.3,"Uitheems","Zoogdieren - klein",21,35,69.3,"UitheemsZoogdieren - klein"]
[99,"UitheemsZoogdieren - klein0036",99,"Uitheems","Zoogdieren - klein",36,50,99,"UitheemsZoogdieren - klein"]
[100,"UitheemsZoogdieren - klein0051",148.5,"Uitheems","Zoogdieren - klein",51,75,148.5,"UitheemsZoogdieren - klein"]
[101,"UitheemsZoogdieren - klein0076",198,"Uitheems","Zoogdieren - klein",76,100,198,"UitheemsZoogdieren - klein"]
[102,"UitheemsZoogdieren - klein0101",247.5,"Uitheems","Zoogdieren - klein",101,125,247.5,"UitheemsZoogdieren - klein"]
[103,"UitheemsZoogdieren - klein0126",297,"Uitheems","Zoogdieren - klein",126,150,297,"UitheemsZoogdieren - klein"]
[104,"UitheemsZoogdieren - klein0151",346.5,"Uitheems","Zoogdieren - klein",151,175,346.5,"UitheemsZoogdieren - klein"]
[105,"UitheemsZoogdieren - klein0176",396,"Uitheems","Zoogdieren - klein",176,200,396,"UitheemsZoogdieren - klein"]
[106,"UitheemsZoogdieren - klein0201",455.4,"Uitheems","Zoogdieren - klein",201,230,455.4,"UitheemsZoogdieren - klein"]
[107,"UitheemsZoogdieren - klein0231",514.79999999999995,"Uitheems","Zoogdieren - klein",231,260,514.79999999999995,"UitheemsZoogdieren - klein"]
[108,"UitheemsZoogdieren - klein0261",594,"Uitheems","Zoogdieren - klein",261,300,594,"UitheemsZoogdieren - klein"]
[109,"UitheemsZoogdieren - middel0001",16.200000000000003,"Uitheems","Zoogdieren - middel",1,3,16.200000000000003,"UitheemsZoogdieren - middel"]
[110,"UitheemsZoogdieren - middel0004",32.400000000000006,"Uitheems","Zoogdieren - middel",4,6,32.400000000000006,"UitheemsZoogdieren - middel"]
[111,"UitheemsZoogdieren - middel0007",48.6,"Uitheems","Zoogdieren - middel",7,9,48.6,"UitheemsZoogdieren - middel"]
[112,"UitheemsZoogdieren - middel0010",81,"Uitheems","Zoogdieren - middel",10,15,81,"UitheemsZoogdieren - middel"]
[113,"UitheemsZoogdieren - middel0016",108,"Uitheems","Zoogdieren - middel",16,20,108,"UitheemsZoogdieren - middel"]
[114,"UitheemsZoogdieren - middel0021",135,"Uitheems","Zoogdieren - middel",21,25,135,"UitheemsZoogdieren - middel"]
[115,"UitheemsZoogdieren - middel0026",162,"Uitheems","Zoogdieren - middel",26,30,162,"UitheemsZoogdieren - middel"]
[116,"UitheemsZoogdieren - middel0031",189,"Uitheems","Zoogdieren - middel",31,35,189,"UitheemsZoogdieren - middel"]
[117,"UitheemsZoogdieren - middel0036",216,"Uitheems","Zoogdieren - middel",36,40,216,"UitheemsZoogdieren - middel"]
[118,"UitheemsZoogdieren - middel0041",243.00000000000003,"Uitheems","Zoogdieren - middel",41,45,243.00000000000003,"UitheemsZoogdieren - middel"]
[119,"UitheemsZoogdieren - middel0046",270,"Uitheems","Zoogdieren - middel",46,50,270,"UitheemsZoogdieren - middel"]
[120,"UitheemsZoogdieren - middel0051",297,"Uitheems","Zoogdieren - middel",51,55,297,"UitheemsZoogdieren - middel"]
[121,"UitheemsZoogdieren - middel0056",324,"Uitheems","Zoogdieren - middel",56,60,324,"UitheemsZoogdieren - middel"]
[122,"UitheemsZoogdieren - middel0061",351,"Uitheems","Zoogdieren - middel",61,65,351,"UitheemsZoogdieren - middel"]
[]
[]
[]
[]
[]
[]
[null,null,null,null,"²"]

{"sheet":"Lijsten","index":8,"n_rows":41,"n_cols":19,"rows_kept":41,"cut":false,"hidden":true,"merged":[]}
["keuze","tarief","tarief",null,null,null,"keuze","keuze","keuze",null,"keuze",null,"tarief",null,null,"Keuze",null,null,"Keuze"]
["Vervoermiddel","Forfait heen/terug","Bijkomende vergoeding/km",null,"Periode:",null,"Individuele dieren","Inheems/Uitheems","Uitheems diersoorten",null,"Inheemse diersoorten",null,"Individuele dieren","Tarief per individueel dier",null,"Diersoort","Identificeren",null,"Geslacht Kat"]
["Auto/bestelwagen",40,0.8,null,"Januari - Maart",null,"Hond","Inheems","Eenden en hoenderen",null,"Eenden en hoenderen",null,"(Hangbuik)varken",10,null,"Hond",6,1,"Kater"]
["Vrachtwagen/trailer",80,1.2,null,"April - Juni",null,"Kat","Uitheems","Zoogdieren - klein",null,"Zoogdieren - klein",null,"Ezel",10,null,"Kat",6,2,"Kattin"]
[null,null,null,null,"Juli - September",null,"Paard",null,"Uitheemse vogels - klein",null,"Amfibieën",null,"Fret",5,null,"Kleine Herkauwer",2.5,3]
[null,null,null,null,"Oktober - December",null,"Ezel",null,"Ganzen en zwanen",null,"Duiven",null,"Geit",8,null,"Paard/Pony/Ezel",6,4]
["Afstanddrempel",50,null,null,null,null,"Fret",null,"Geleedpotigen",null,"Fazant & Wilde Eend",null,"Hond",10]
[null,null,null,null,null,null,"Geit",null,"Grote herbivoren",null,"Ganzen en zwanen",null,"Kat",10,null,null,"Registreren",null,"Keuze"]
["tab dierenarts vanaf","2023-06-01","Tab Dierenarts pas invullen vanaf datum IBN ",{"$f":"C9&TEXT(B9,\"dd/mm/jjjj\")","v":"Tab Dierenarts pas invullen vanaf datum IBN 01/06/2023"},null,null,"(Hangbuik)varken",null,"Grote katachtigen",null,"Insectenetende wildzang",null,"Konijn",3,null,"Hond",10.46,null,"janee"]
["factuurdatum vanaf","2022-01-01","Factuurdatum vanaf ",{"$f":"C10&TEXT(B10,\"dd/mm/jjjj\")","v":"Factuurdatum vanaf 01/01/2022"},null,null,"Konijn",null,"Hagedissen",null,"Kraaiachtigen",null,"Paard",10,null,"Kat",2.9,null,"ja"]
[null,null,null,null,null,null,"Pony",null,"Kleine/Middel katachtigen",null,"Meeuwachtigen",null,"Pony",10,null,"Kleine Herkauwer",0,null,"nee"]
["dwz2023",null,null,null,null,null,"Rund",null,"Koraal",null,"Reigers, ooievaars, kraanvogels",null,"Rund",10,null,"Paard/Pony/Ezel",49.58]
[null,null,null,null,null,null,"Schaap",null,"Krokodillen  < 1 m",null,"Reptielen",null,"Schaap",8]
["Diergeneeskundig verslag: 35,00 euro, te vermeerderen met 5 euro per schijf van 10 dieren dwz",null,null,null,null,null,null,null,"Krokodillen  > 1 m",null,"Roofvogels (categorie A+B)"]
["1-10 dieren: 35 euro",null,null,null,null,null,null,null,"Landschildpadden",null,"Roofvogels (categorie C)",null,null,null,null,null,"Paspoort"]
["11-20 dieren: 40 euro",null,null,null,null,null,null,null,"Papegaaien",null,"Roofvogels (categorie D)",null,null,null,null,"Kat",0]
["21-30 dieren: 45 euro",null,null,null,null,null,null,null,"Primaten groot",null,"Roofvogels (categorie E)",null,null,null,null,"Hond",1]
[null,null,null,null,null,null,null,null,"Primaten klein",null,"Roofvogels (categorie F)",null,null,null,null,"Kleine Herkauwer",0]
[1,5,{"$f":"A19/10","v":0.1},{"$f":"30+ROUNDUP(A19/10,0)*5","v":35},null,null,null,null,"Primaten middel",null,"Waad- en Weidevogels",null,null,null,null,"Paard/Pony/Ezel",26.15]
[2,5,{"$f":"A20/10","v":0.2},{"$f":"30+ROUNDUP(A20/10,0)*5","v":35},null,null,null,null,"Primaten zeer groot",null,"Zaadetende wildzang"]
[3,5,0.3,35,null,null,null,null,"Roofvogels (categorie A+B)",null,"Zeevogels"]
[4,5,0.4,35,null,null,null,null,"Roofvogels (categorie C)",null,"Zoogdieren - groot",null,null,null,null,null,"Vaccinatie"]
[5,5,0.5,35,null,null,null,null,"Roofvogels (categorie D)",null,"Zoogdieren - middel",null,null,null,null,"Hond",40]
[6,5,0.6,35,null,null,null,null,"Roofvogels (categorie E)",null,null,null,null,null,null,"Kat",40]
[7,5,0.7,35,null,null,null,null,"Roofvogels (categorie F)",null,null,null,null,null,null,"Kleine Herkauwer",0]
[8,5,0.8,35,null,null,null,null,"Slangen < 1m",null,null,null,null,null,null,"Paard/Pony/Ezel",0]
[9,5,0.9,35,null,null,null,null,"Slangen > 1m"]
[10,5,1,35,null,null,null,null,"Uitheemse amfibieën - Groot"]
[11,10,{"$f":"A29/10","v":1.1000000000000001},40,null,null,null,null,"Uitheemse amfibieën - klein",null,null,null,null,null,null,null,"Sterilisatie/castratie kattin"]
[12,10,null,40,null,null,null,null,"Uitheemse vogels - groot",null,null,null,null,null,null,"Kater",30]
[13,10,null,40,null,null,null,null,"Uitheemse vogels - middel",null,null,null,null,null,null,"Kattin",70]
[14,10,null,40,null,null,null,null,"Vissen > 200 gram"]
[15,10,null,40,null,null,null,null,"Vissen 0-100 gram"]
[16,10,null,40,null,null,null,null,"Vissen 100-200 gram"]
[17,10,null,40,null,null,null,null,"Waterschildpadden"]
[18,10,null,40,null,null,null,null,"Zoogdieren - groot"]
[19,10,null,40,null,null,null,null,"Zoogdieren - middel"]
[20,10,null,40]
[21,15,null,45]
[22,15,null,45]
[23,15,null,45]