{"text_format":"1","workbook":"xlsx","n_sheets":5,"sheets":["Dashboard","Pop Model - do not touch","Costs and welfare - dont touch","Rates - do not touch","Cluster analysis"],"not_rendered":{"charts":2,"images":0,"macros":1,"external_links":0,"defined_names":5,"comments":0,"pivot_tables":0},"unopened":[],"bounds":{"document_bytes":16777216,"sheet_cells":100000,"rows_first":2000,"rows_last":500,"rows_between":2000,"halvings":0,"cell_chars":16384,"cell_head_chars":4096},"cells_cut":0,"cells_raw":0,"read":"whole","date_system":"1900"}

{"sheet":"Dashboard","index":0,"n_rows":61,"n_cols":14,"rows_kept":61,"cut":false,"hidden":false,"merged":[[16,6,16,9],[28,6,28,9],[29,6,29,9],[30,6,30,9],[31,6,31,9],[27,6,27,10],[37,1,37,12],[25,6,25,9],[17,6,17,9],[18,6,18,9],[19,6,19,9],[20,6,20,9],[22,6,22,9],[21,6,21,9],[23,6,23,9],[24,6,24,9]]}
[]
[null,"INPUT"]
[null,"Startpopulaties","Beginwaarden","Eigen invoer"]
[null,"Aantal inwoners ",33141,33141]
[null,"Aantal huiskatten ",6164,{"$f":"N20","v":6164}]
[null,"Aantal zwerfkatten ",1104,{"$f":"N21","v":1104}]
[null,"% vruchtbare zwerfkatten",37,{"$f":"N23","v":37}]
[null,"Aantal koloniekatten ",{"$f":"ROUND(((1704+136)/(520504+1200))*$C$4,0)","v":117},{"$f":"N22","v":117}]
[null,"Type habitat",null,"Alle"]
[null,"Ingrepen via huiskatten","Beginwaarden","Eigen invoer"]
[null,"Proportie vruchtbare huiskatten (in %)",0.12,0.12]
[null,"Proportie gedumpte huiskatten die zwerfkat worden (in %)",0.05,0.05]
[null,"Proportie verloren huiskatten weer bij eigenaar (in %)",0.05,0.05]
[null,"Ingrepen via zwerfkatten ","Beginwaarden","Eigen invoer"]
[null,"Proportie gevangen zwerfkatten van totale zwerfkattenpopulatie (in %)",0,0]
{"$rows_left_out":47}
{"sheet":"Pop Model - do not touch","index":1,"n_rows":42,"n_cols":17,"rows_kept":42,"cut":false,"hidden":true,"merged":[]}
[null,0,1,2,3,4,5,6,7,8,9,10]
["HC_Pop_start",null,{"$f":"IF('Rates - do not touch'!B4=Dashboard!D5,'Rates - do not touch'!B4,Dashboard!D5)","v":6164},{"$f":"C20","v":6164},{"$f":"D20","v":6164},6164,6164,6164,6164,6164,6164,6164,null,"HC pop is stable"]
["HC_GrowthRate",null,{"$f":"'Rates - do not touch'!$B$14","v":2.9017199999999937E-2},{"$f":"'Rates - do not touch'!$B$14","v":2.9017199999999937E-2},{"$f":"'Rates - do not touch'!$B$14","v":2.9017199999999937E-2},{"$f":"'Rates - do not touch'!$B$14","v":2.9017199999999937E-2},{"$f":"'Rates - do not touch'!$B$14","v":2.9017199999999937E-2},{"$f":"'Rates - do not touch'!$B$14","v":2.9017199999999937E-2},{"$f":"'Rates - do not touch'!$B$14","v":2.9017199999999937E-2},{"$f":"'Rates - do not touch'!$B$14","v":2.9017199999999937E-2},{"$f":"'Rates - do not touch'!$B$14","v":2.9017199999999937E-2},{"$f":"'Rates - do not touch'!$B$14","v":2.9017199999999937E-2},null,"GR = Br, AB, Re, Death"]
["HC_PopChange",null,{"$f":"C3*C2","v":178.86202079999961},{"$f":"D3*D2","v":178.86202079999961},178.86202079999961,178.86202079999961,178.86202079999961,{"$f":"H3*H2","v":178.86202079999961},{"$f":"I3*I2","v":178.86202079999961},{"$f":"J3*J2","v":178.86202079999961},{"$f":"K3*K2","v":178.86202079999961},{"$f":"L3*L2","v":178.86202079999961},null,"Positive is how many HC are \"lost\", negative is how many strays are \"gained\""]
[]
["StrayCat_B_Start",null,{"$f":"IF(Dashboard!D6*'Rates - do not touch'!B16 * 0.5 = 'Rates - do not touch'!B5,'Rates - do not touch'!B5,Dashboard!D6*'Rates - do not touch'!B16*0.5)","v":204.24},{"$f":"C10","v":294},{"$f":"D10","v":414},574,787,1072,1452,1959,2636,3539,null,"Start of breeding pop",null,null,"EP (10-11-18): aangepast dat rate niet standaard 0,37 is, maar die van dashboard --> verwijzing naar tab rats B16 ipv handmatige 0,37)"]
["StrayCatGrowth",null,{"$f":"IF(C6>0,C6*'Rates - do not touch'!$B$19,0)","v":68.321927399615987},{"$f":"IF(D6>0,D6*'Rates - do not touch'!$B$19,0)","v":98.348250369599981},{"$f":"IF(E6>0,E6*'Rates - do not touch'!$B$19,0)","v":138.49039337759996},{"$f":"IF(F6>0,F6*'Rates - do not touch'!$B$19,0)","v":192.01325072159995},{"$f":"IF(G6>0,G6*'Rates - do not touch'!$B$19,0)","v":263.26555456079996},{"$f":"IF(H6>0,H6*'Rates - do not touch'!$B$19,0)","v":358.60314420479995},{"$f":"IF(I6>0,I6*'Rates - do not touch'!$B$19,0)","v":485.7199303967999},{"$f":"IF(J6>0,J6*'Rates - do not touch'!$B$19,0)","v":655.32048460559986},{"$f":"IF(K6>0,K6*'Rates - do not touch'!$B$19,0)","v":881.78907474239975},{"$f":"IF(L6>0,L6*'Rates - do not touch'!$B$19,0)","v":1183.8587008775996},null,"From breeding and if HC increase then surplus housecats also go here"]
["StrayCatLoss",null,{"$f":"IF(C6>0,(C6*'Rates - do not touch'!$B$27*'Rates - do not touch'!$B$32)+(C6*'Rates - do not touch'!$B$28*'Rates - do not touch'!$B$32)+(C6*'Rates - do not touch'!$B$29*'Rates - do not touch'!$B$32)+(C6*'Rates - do not touch'!$B$30*'Rates - do not touch'!$B$32),0)","v":0},{"$f":"IF(D6>0,(D6*'Rates - do not touch'!$B$27*'Rates - do not touch'!$B$32)+(D6*'Rates - do not touch'!$B$28*'Rates - do not touch'!$B$32)+(D6*'Rates - do not touch'!$B$29*'Rates - do not touch'!$B$32)+(D6*'Rates - do not touch'!$B$30*'Rates - do not touch'!$B$32),0)","v":0},{"$f":"IF(E6>0,(E6*'Rates - do not touch'!$B$27*'Rates - do not touch'!$B$32)+(E6*'Rates - do not touch'!$B$28*'Rates - do not touch'!$B$32)+(E6*'Rates - do not touch'!$B$29*'Rates - do not touch'!$B$32)+(E6*'Rates - do not touch'!$B$30*'Rates - do not touch'!$B$32),0)","v":0},{"$f":"IF(F6>0,(F6*'Rates - do not touch'!$B$27*'Rates - do not touch'!$B$32)+(F6*'Rates - do not touch'!$B$28*'Rates - do not touch'!$B$32)+(F6*'Rates - do not touch'!$B$29*'Rates - do not touch'!$B$32)+(F6*'Rates - do not touch'!$B$30*'Rates - do not touch'!$B$32),0)","v":0},{"$f":"IF(G6>0,(G6*'Rates - do not touch'!$B$27*'Rates - do not touch'!$B$32)+(G6*'Rates - do not touch'!$B$28*'Rates - do not touch'!$B$32)+(G6*'Rates - do not touch'!$B$29*'Rates - do not touch'!$B$32)+(G6*'Rates - do not touch'!$B$30*'Rates - do not touch'!$B$32),0)","v":0},{"$f":"IF(H6>0,(H6*'Rates - do not touch'!$B$27*'Rates - do not touch'!$B$32)+(H6*'Rates - do not touch'!$B$28*'Rates - do not touch'!$B$32)+(H6*'Rates - do not touch'!$B$29*'Rates - do not touch'!$B$32)+(H6*'Rates - do not touch'!$B$30*'Rates - do not touch'!$B$32),0)","v":0},{"$f":"IF(I6>0,(I6*'Rates - do not touch'!$B$27*'Rates - do not touch'!$B$32)+(I6*'Rates - do not touch'!$B$28*'Rates - do not touch'!$B$32)+(I6*'Rates - do not touch'!$B$29*'Rates - do not touch'!$B$32)+(I6*'Rates - do not touch'!$B$30*'Rates - do not touch'!$B$32),0)","v":0},{"$f":"IF(J6>0,(J6*'Rates - do not touch'!$B$27*'Rates - do not touch'!$B$32)+(J6*'Rates - do not touch'!$B$28*'Rates - do not touch'!$B$32)+(J6*'Rates - do not touch'!$B$29*'Rates - do not touch'!$B$32)+(J6*'Rates - do not touch'!$B$30*'Rates - do not touch'!$B$32),0)","v":0},{"$f":"IF(K6>0,(K6*'Rates - do not touch'!$B$27*'Rates - do not touch'!$B$32)+(K6*'Rates - do not touch'!$B$28*'Rates - do not touch'!$B$32)+(K6*'Rates - do not touch'!$B$29*'Rates - do not touch'!$B$32)+(K6*'Rates - do not touch'!$B$30*'Rates - do not touch'!$B$32),0)","v":0},{"$f":"IF(L6>0,(L6*'Rates - do not touch'!$B$27*'Rates - do not touch'!$B$32)+(L6*'Rates - do not touch'!$B$28*'Rates - do not touch'!$B$32)+(L6*'Rates - do not touch'!$B$29*'Rates - do not touch'!$B$32)+(L6*'Rates - do not touch'!$B$30*'Rates - do not touch'!$B$32),0)","v":0},null,"From death, TNR, Euth, Shel, Comm"]
["StrayCat_B_2House",null,{"$f":"IF(C3<0,C4*'Rates - do not touch'!B16, C4*'Rates - do not touch'!$B$10)","v":21.463442495999953},{"$f":"IF(D3<0,D4*'Rates - do not touch'!B16, D4*'Rates - do not touch'!$B$10)","v":21.463442495999953},{"$f":"IF(E3<0,E4*'Rates - do not touch'!B16, E4*'Rates - do not touch'!$B$10)","v":21.463442495999953},{"$f":"IF(F3<0,F4*'Rates - do not touch'!B16, F4*'Rates - do not touch'!$B$10)","v":21.463442495999953},{"$f":"IF(G3<0,G4*'Rates - do not touch'!B16, G4*'Rates - do not touch'!$B$10)","v":21.463442495999953},{"$f":"IF(H3<0,H4*'Rates - do not touch'!B16, H4*'Rates - do not touch'!$B$10)","v":21.463442495999953},{"$f":"IF(I3<0,I4*'Rates - do not touch'!B16, I4*'Rates - do not touch'!$B$10)","v":21.463442495999953},{"$f":"IF(J3<0,J4*'Rates - do not touch'!B16, J4*'Rates - do not touch'!$B$10)","v":21.463442495999953},{"$f":"IF(K3<0,K4*'Rates - do not touch'!B16, K4*'Rates - do not touch'!$B$10)","v":21.463442495999953},{"$f":"IF(L3<0,L4*'Rates - do not touch'!B16, L4*'Rates - do not touch'!$B$10)","v":21.463442495999953},null,"Negative: How many stray cats become house cats to maintain HC, Positive: How many HC become stray",null,null,"EP (10-11-18): aangepast dat rate niet standaard 0,37 is, maar die van dashboard --> verwijzing naar tab rats B16 ipv handmatige 0,37)"]
["StrayCatPop_B",{"$f":"'Rates - do not touch'!B5","v":204},{"$f":"IF(ROUND(C6+C7-C8+C9,0) >0,ROUND(C6+C7-C8+C9,0),0)","v":294},{"$f":"IF(ROUND(D6+D7-D8+D9,0) >0,ROUND(D6+D7-D8+D9,0),0)","v":414},574,787,1072,1452,1959,2636,3539,4744,null,"Final pop of breeding stray cats"]
["StrayCat_B_2CC",null,{"$f":"(C6*'Rates - do not touch'!$B$30*'Rates - do not touch'!$B$32)","v":0},{"$f":"(D6*'Rates - do not touch'!$B$30*'Rates - do not touch'!$B$32)","v":0},{"$f":"(E6*'Rates - do not touch'!$B$30*'Rates - do not touch'!$B$32)","v":0},{"$f":"(F6*'Rates - do not touch'!$B$30*'Rates - do not touch'!$B$32)","v":0},{"$f":"(G6*'Rates - do not touch'!$B$30*'Rates - do not touch'!$B$32)","v":0},{"$f":"(H6*'Rates - do not touch'!$B$30*'Rates - do not touch'!$B$32)","v":0},{"$f":"(I6*'Rates - do not touch'!$B$30*'Rates - do not touch'!$B$32)","v":0},{"$f":"(J6*'Rates - do not touch'!$B$30*'Rates - do not touch'!$B$32)","v":0},{"$f":"(K6*'Rates - do not touch'!$B$30*'Rates - do not touch'!$B$32)","v":0},{"$f":"(L6*'Rates - do not touch'!$B$30*'Rates - do not touch'!$B$32)","v":0}]
[]
["StrayCat_NB_Start",null,{"$f":"IF(Dashboard!D6*(1-'Rates - do not touch'!B16)+'Pop Model - do not touch'!C6='Rates - do not touch'!B6,'Rates - do not touch'!B6,Dashboard!D6*(1-'Rates - do not touch'!B16)+'Pop Model - do not touch'!C6)","v":899.76},{"$f":"C17","v":751.24017830399953},{"$f":"D17","v":833.51473877759929},907.56184320383909,974.20423718745496,1034.1823917727093,1088.1627308994382,1136.7450361134938,1180.4691108061443,1219.8207780295297,null,"Start of non breeding pop",null,null,"EP (10-11-18): aangepast dat rate niet standaard 0,37 is, maar die van dashboard --> verwijzing naar tab rats B16 ipv handmatige 0,37)"]
["StrayCat_NB_Growth",null,{"$f":"IF(C4>0,C4*(1-'Rates - do not touch'!$B$10),0)","v":157.39857830399967},{"$f":"IF(D4>0,D4*(1-'Rates - do not touch'!$B$10),0)","v":157.39857830399967},{"$f":"IF(E4>0,E4*(1-'Rates - do not touch'!$B$10),0)","v":157.39857830399967},{"$f":"IF(F4>0,F4*(1-'Rates - do not touch'!$B$10),0)","v":157.39857830399967},{"$f":"IF(G4>0,G4*(1-'Rates - do not touch'!$B$10),0)","v":157.39857830399967},{"$f":"IF(H4>0,H4*(1-'Rates - do not touch'!$B$10),0)","v":157.39857830399967},{"$f":"IF(I4>0,I4*(1-'Rates - do not touch'!$B$10),0)","v":157.39857830399967},{"$f":"IF(J4>0,J4*(1-'Rates - do not touch'!$B$10),0)","v":157.39857830399967},{"$f":"IF(K4>0,K4*(1-'Rates - do not touch'!$B$10),0)","v":157.39857830399967},{"$f":"IF(L4>0,L4*(1-'Rates - do not touch'!$B$10),0)","v":157.39857830399967},null,"Growth of non breeding pop only non zero when HC GR is positive and some non breeding housecats become stray"]
["StrayCat_NB_Loss",null,{"$f":"(C13*'Rates - do not touch'!$B$21)+(C13*'Rates - do not touch'!$B$28*'Rates - do not touch'!$B$32)+('Pop Model - do not touch'!C13*'Rates - do not touch'!$B$29*'Rates - do not touch'!$B$32)+('Pop Model - do not touch'!C13*'Rates - do not touch'!$B$30*'Rates - do not touch'!$B$32)","v":305.91840000000002},{"$f":"(D13*0.1)+(D13*'Rates - do not touch'!$B$28*'Rates - do not touch'!$B$32)+('Pop Model - do not touch'!D13*'Rates - do not touch'!$B$29*'Rates - do not touch'!$B$32)+('Pop Model - do not touch'!D13*'Rates - do not touch'!$B$30*'Rates - do not touch'!$B$32)+(D16*-1)","v":75.12401783039995},{"$f":"(E13*0.1)+(E13*'Rates - do not touch'!$B$28*'Rates - do not touch'!$B$32)+('Pop Model - do not touch'!E13*'Rates - do not touch'!$B$29*'Rates - do not touch'!$B$32)+('Pop Model - do not touch'!E13*'Rates - do not touch'!$B$30*'Rates - do not touch'!$B$32)+(E16*-1)","v":83.351473877759929},{"$f":"(F13*0.1)+(F13*'Rates - do not touch'!$B$28*'Rates - do not touch'!$B$32)+('Pop Model - do not touch'!F13*'Rates - do not touch'!$B$29*'Rates - do not touch'!$B$32)+('Pop Model - do not touch'!F13*'Rates - do not touch'!$B$30*'Rates - do not touch'!$B$32)+(F16*-1)","v":90.756184320383909},{"$f":"(G13*0.1)+(G13*'Rates - do not touch'!$B$28*'Rates - do not touch'!$B$32)+('Pop Model - do not touch'!G13*'Rates - do not touch'!$B$29*'Rates - do not touch'!$B$32)+('Pop Model - do not touch'!G13*'Rates - do not touch'!$B$30*'Rates - do not touch'!$B$32)+(G16*-1)","v":97.420423718745496},{"$f":"(H13*0.1)+(H13*'Rates - do not touch'!$B$28*'Rates - do not touch'!$B$32)+('Pop Model - do not touch'!H13*'Rates - do not touch'!$B$29*'Rates - do not touch'!$B$32)+('Pop Model - do not touch'!H13*'Rates - do not touch'!$B$30*'Rates - do not touch'!$B$32)+(H16*-1)","v":103.41823917727093},{"$f":"(I13*0.1)+(I13*'Rates - do not touch'!$B$28*'Rates - do not touch'!$B$32)+('Pop Model - do not touch'!I13*'Rates - do not touch'!$B$29*'Rates - do not touch'!$B$32)+('Pop Model - do not touch'!I13*'Rates - do not touch'!$B$30*'Rates - do not touch'!$B$32)+(I16*-1)","v":108.81627308994382},{"$f":"(J13*0.1)+(J13*'Rates - do not touch'!$B$28*'Rates - do not touch'!$B$32)+('Pop Model - do not touch'!J13*'Rates - do not touch'!$B$29*'Rates - do not touch'!$B$32)+('Pop Model - do not touch'!J13*'Rates - do not touch'!$B$30*'Rates - do not touch'!$B$32)+(J16*-1)","v":113.67450361134939},{"$f":"(K13*0.1)+(K13*'Rates - do not touch'!$B$28*'Rates - do not touch'!$B$32)+('Pop Model - do not touch'!K13*'Rates - do not touch'!$B$29*'Rates - do not touch'!$B$32)+('Pop Model - do not touch'!K13*'Rates - do not touch'!$B$30*'Rates - do not touch'!$B$32)+(K16*-1)","v":118.04691108061444},{"$f":"(L13*0.1)+(L13*'Rates - do not touch'!$B$28*'Rates - do not touch'!$B$32)+('Pop Model - do not touch'!L13*'Rates - do not touch'!$B$29*'Rates - do not touch'!$B$32)+('Pop Model - do not touch'!L13*'Rates - do not touch'!$B$30*'Rates - do not touch'!$B$32)+(L16*-1)","v":121.98207780295297},null,"Loss from treatments and becoming community cats and by death"]
{"$rows_left_out":28}
{"sheet":"Costs and welfare - dont touch","index":2,"n_rows":32,"n_cols":13,"rows_kept":32,"cut":false,"hidden":true,"merged":[]}
[]
["Year",0,1,2,3,4,5,6,7,8,9,10]
["Costs"]
["CatsTNR",0,{"$f":"IF('Pop Model - do not touch'!C22>0,('Pop Model - do not touch'!C22*Dashboard!$K$29),0)","v":0},{"$f":"IF('Pop Model - do not touch'!D22>0,('Pop Model - do not touch'!D22*Dashboard!$K$29),0)","v":0},{"$f":"IF('Pop Model - do not touch'!E22>0,('Pop Model - do not touch'!E22*Dashboard!$K$29),0)","v":0},{"$f":"IF('Pop Model - do not touch'!F22>0,('Pop Model - do not touch'!F22*Dashboard!$K$29),0)","v":0},{"$f":"IF('Pop Model - do not touch'!G22>0,('Pop Model - do not touch'!G22*Dashboard!$K$29),0)","v":0},{"$f":"IF('Pop Model - do not touch'!H22>0,('Pop Model - do not touch'!H22*Dashboard!$K$29),0)","v":0},{"$f":"IF('Pop Model - do not touch'!I22>0,('Pop Model - do not touch'!I22*Dashboard!$K$29),0)","v":0},{"$f":"IF('Pop Model - do not touch'!J22>0,('Pop Model - do not touch'!J22*Dashboard!$K$29),0)","v":0},{"$f":"IF('Pop Model - do not touch'!K22>0,('Pop Model - do not touch'!K22*Dashboard!$K$29),0)","v":0},{"$f":"IF('Pop Model - do not touch'!L22>0,('Pop Model - do not touch'!L22*Dashboard!$K$29),0)","v":0}]
["CatsEuth",0,{"$f":"IF('Pop Model - do not touch'!C29>0, 'Pop Model - do not touch'!C29*Dashboard!$K$31,0)","v":0},{"$f":"IF('Pop Model - do not touch'!D29>0, 'Pop Model - do not touch'!D29*Dashboard!$K$31,0)","v":0},{"$f":"IF('Pop Model - do not touch'!E29>0, 'Pop Model - do not touch'!E29*Dashboard!$K$31,0)","v":0},{"$f":"IF('Pop Model - do not touch'!F29>0, 'Pop Model - do not touch'!F29*Dashboard!$K$31,0)","v":0},{"$f":"IF('Pop Model - do not touch'!G29>0, 'Pop Model - do not touch'!G29*Dashboard!$K$31,0)","v":0},{"$f":"IF('Pop Model - do not touch'!H29>0, 'Pop Model - do not touch'!H29*Dashboard!$K$31,0)","v":0},{"$f":"IF('Pop Model - do not touch'!I29>0, 'Pop Model - do not touch'!I29*Dashboard!$K$31,0)","v":0},{"$f":"IF('Pop Model - do not touch'!J29>0, 'Pop Model - do not touch'!J29*Dashboard!$K$31,0)","v":0},{"$f":"IF('Pop Model - do not touch'!K29>0, 'Pop Model - do not touch'!K29*Dashboard!$K$31,0)","v":0},{"$f":"IF('Pop Model - do not touch'!L29>0, 'Pop Model - do not touch'!L29*Dashboard!$K$31,0)","v":0}]
["NBCatsCC",0,{"$f":"IF('Pop Model - do not touch'!C18>0,'Pop Model - do not touch'!C18*(Dashboard!$K$30-Dashboard!$D$23),0)","v":0},{"$f":"IF('Pop Model - do not touch'!D18>0,'Pop Model - do not touch'!D18*(Dashboard!$K$30-Dashboard!$D$23),0)","v":0},{"$f":"IF('Pop Model - do not touch'!E18>0,'Pop Model - do not touch'!E18*(Dashboard!$K$30-Dashboard!$D$23),0)","v":0},{"$f":"IF('Pop Model - do not touch'!F18>0,'Pop Model - do not touch'!F18*(Dashboard!$K$30-Dashboard!$D$23),0)","v":0},{"$f":"IF('Pop Model - do not touch'!G18>0,'Pop Model - do not touch'!G18*(Dashboard!$K$30-Dashboard!$D$23),0)","v":0},{"$f":"IF('Pop Model - do not touch'!H18>0,'Pop Model - do not touch'!H18*(Dashboard!$K$30-Dashboard!$D$23),0)","v":0},{"$f":"IF('Pop Model - do not touch'!I18>0,'Pop Model - do not touch'!I18*(Dashboard!$K$30-Dashboard!$D$23),0)","v":0},{"$f":"IF('Pop Model - do not touch'!J18>0,'Pop Model - do not touch'!J18*(Dashboard!$K$30-Dashboard!$D$23),0)","v":0},{"$f":"IF('Pop Model - do not touch'!K18>0,'Pop Model - do not touch'!K18*(Dashboard!$K$30-Dashboard!$D$23),0)","v":0},{"$f":"IF('Pop Model - do not touch'!L18>0,'Pop Model - do not touch'!L18*(Dashboard!$K$30-Dashboard!$D$23),0)","v":0}]
["BCatsCC",null,{"$f":"IF('Pop Model - do not touch'!C11>0,'Pop Model - do not touch'!C11*Dashboard!$K$30,0)","v":0},{"$f":"IF('Pop Model - do not touch'!D11>0,'Pop Model - do not touch'!D11*Dashboard!$K$30,0)","v":0},{"$f":"IF('Pop Model - do not touch'!E11>0,'Pop Model - do not touch'!E11*Dashboard!$K$30,0)","v":0},{"$f":"IF('Pop Model - do not touch'!F11>0,'Pop Model - do not touch'!F11*Dashboard!$K$30,0)","v":0},{"$f":"IF('Pop Model - do not touch'!G11>0,'Pop Model - do not touch'!G11*Dashboard!$K$30,0)","v":0},{"$f":"IF('Pop Model - do not touch'!H11>0,'Pop Model - do not touch'!H11*Dashboard!$K$30,0)","v":0},{"$f":"IF('Pop Model - do not touch'!I11>0,'Pop Model - do not touch'!I11*Dashboard!$K$30,0)","v":0},{"$f":"IF('Pop Model - do not touch'!J11>0,'Pop Model - do not touch'!J11*Dashboard!$K$30,0)","v":0},{"$f":"IF('Pop Model - do not touch'!K11>0,'Pop Model - do not touch'!K11*Dashboard!$K$30,0)","v":0},{"$f":"IF('Pop Model - do not touch'!L11>0,'Pop Model - do not touch'!L11*Dashboard!$K$30,0)","v":0}]
["ShelterCost",null,{"$f":"IF('Pop Model - do not touch'!C31>0,'Pop Model - do not touch'!C31*Dashboard!$K$32,0)","v":0},{"$f":"IF('Pop Model - do not touch'!D31>0,'Pop Model - do not touch'!D31*Dashboard!$K$32,0)","v":0},{"$f":"IF('Pop Model - do not touch'!E31>0,'Pop Model - do not touch'!E31*Dashboard!$K$32,0)","v":0},{"$f":"IF('Pop Model - do not touch'!F31>0,'Pop Model - do not touch'!F31*Dashboard!$K$32,0)","v":0},{"$f":"IF('Pop Model - do not touch'!G31>0,'Pop Model - do not touch'!G31*Dashboard!$K$32,0)","v":0},{"$f":"IF('Pop Model - do not touch'!H31>0,'Pop Model - do not touch'!H31*Dashboard!$K$32,0)","v":0},{"$f":"IF('Pop Model - do not touch'!I31>0,'Pop Model - do not touch'!I31*Dashboard!$K$32,0)","v":0},{"$f":"IF('Pop Model - do not touch'!J31>0,'Pop Model - do not touch'!J31*Dashboard!$K$32,0)","v":0},{"$f":"IF('Pop Model - do not touch'!K31>0,'Pop Model - do not touch'!K31*Dashboard!$K$32,0)","v":0},{"$f":"IF('Pop Model - do not touch'!L31>0,'Pop Model - do not touch'!L31*Dashboard!$K$32,0)","v":0}]
["FullCost",null,{"$f":"SUM(C4:C8)","v":0},{"$f":"SUM(D4:D8)","v":0},{"$f":"SUM(E4:E8)","v":0},0,0,0,0,0,0,0,"EP: sheltercost included in full cost 7-11-18"]
["ContractCost",null,{"$f":"IF(Dashboard!$D$33>0,SUM('Pop Model - do not touch'!C22,'Pop Model - do not touch'!C29,'Pop Model - do not touch'!C18,'Pop Model - do not touch'!C11,'Pop Model - do not touch'!C31)*Dashboard!$D$33,0)","v":0},{"$f":"IF(Dashboard!$D$33>0,SUM('Pop Model - do not touch'!D22,'Pop Model - do not touch'!D29,'Pop Model - do not touch'!D18,'Pop Model - do not touch'!D11,'Pop Model - do not touch'!D31)*Dashboard!$D$33,0)","v":0},{"$f":"IF(Dashboard!$D$33>0,SUM('Pop Model - do not touch'!E22,'Pop Model - do not touch'!E29,'Pop Model - do not touch'!E18,'Pop Model - do not touch'!E11,'Pop Model - do not touch'!E31)*Dashboard!$D$33,0)","v":0},{"$f":"IF(Dashboard!$D$33>0,SUM('Pop Model - do not touch'!F22,'Pop Model - do not touch'!F29,'Pop Model - do not touch'!F18,'Pop Model - do not touch'!F11,'Pop Model - do not touch'!F31)*Dashboard!$D$33,0)","v":0},{"$f":"IF(Dashboard!$D$33>0,SUM('Pop Model - do not touch'!G22,'Pop Model - do not touch'!G29,'Pop Model - do not touch'!G18,'Pop Model - do not touch'!G11,'Pop Model - do not touch'!G31)*Dashboard!$D$33,0)","v":0},{"$f":"IF(Dashboard!$D$33>0,SUM('Pop Model - do not touch'!H22,'Pop Model - do not touch'!H29,'Pop Model - do not touch'!H18,'Pop Model - do not touch'!H11,'Pop Model - do not touch'!H31)*Dashboard!$D$33,0)","v":0},{"$f":"IF(Dashboard!$D$33>0,SUM('Pop Model - do not touch'!I22,'Pop Model - do not touch'!I29,'Pop Model - do not touch'!I18,'Pop Model - do not touch'!I11,'Pop Model - do not touch'!I31)*Dashboard!$D$33,0)","v":0},{"$f":"IF(Dashboard!$D$33>0,SUM('Pop Model - do not touch'!J22,'Pop Model - do not touch'!J29,'Pop Model - do not touch'!J18,'Pop Model - do not touch'!J11,'Pop Model - do not touch'!J31)*Dashboard!$D$33,0)","v":0},{"$f":"IF(Dashboard!$D$33>0,SUM('Pop Model - do not touch'!K22,'Pop Model - do not touch'!K29,'Pop Model - do not touch'!K18,'Pop Model - do not touch'!K11,'Pop Model - do not touch'!K31)*Dashboard!$D$33,0)","v":0},{"$f":"IF(Dashboard!$D$33>0,SUM('Pop Model - do not touch'!L22,'Pop Model - do not touch'!L29,'Pop Model - do not touch'!L18,'Pop Model - do not touch'!L11,'Pop Model - do not touch'!L31)*Dashboard!$D$33,0)","v":0}]
[]
["Plot_CostContract",null,{"$f":"IF(C10=0,NA(),C10)","v":{"$error":"#N/A"}},{"$f":"IF(D10=0,NA(),D10)","v":{"$error":"#N/A"}},{"$error":"#N/A"},{"$error":"#N/A"},{"$error":"#N/A"},{"$error":"#N/A"},{"$error":"#N/A"},{"$error":"#N/A"},{"$error":"#N/A"},{"$error":"#N/A"}]
["Plot_CostTNR",null,{"$f":"IF(C10>0,NA(),C4)","v":0},{"$f":"IF(D10>0,NA(),D4)","v":0},0,0,0,0,0,0,0,0]
["Plot_CostEuth",null,{"$f":"IF(C10>0,NA(),C5)","v":0},{"$f":"IF(D10>0,NA(),D5)","v":0},0,0,0,0,0,0,0,0]
["Plot_CC",null,{"$f":"IF(C10>0, NA(), SUM(C6:C7))","v":0},{"$f":"IF(D10>0, NA(), SUM(D6:D7))","v":0},0,0,0,0,0,0,0,0]
{"$rows_left_out":18}
{"sheet":"Rates - do not touch","index":3,"n_rows":45,"n_cols":10,"rows_kept":45,"cut":false,"hidden":true,"merged":[]}
["Parameters"]
["Human population",{"$f":"Dashboard!D4","v":33141},null,"Can maybe change this so that it is municipality? If there is some kind of lookup table where people select their municipality and it automatically gives the population for that municipality?"]
[]
["StartHC",{"$f":"ROUND(0.186*$B$2,0)","v":6164}]
["StartBSC_F",{"$f":"ROUND(($B$2/30)*0.37*0.5,0)","v":204}]
["StartNBSC",{"$f":"ROUND(($B$2/30)*(1-0.37)+B5,0)","v":900},null,"Non breeding cats plus males who could be breeding but don’t contribute to growth rate"]
["StartTNRS",0]
["StartCC",{"$f":"Dashboard!D8","v":117}]
[]
["Prop HC breeding",{"$f":"Dashboard!D11","v":0.12},null,"10 % of all housecats "]
["HC death rate per year",0.23,null,"From literature"]
["HC abandonment",{"$f":"Dashboard!D12","v":0.05}]
["HC recovery rate",{"$f":"Dashboard!D13","v":0.05}]
["HC growth rate",{"$f":"3.82*1.63*0.7*('Rates - do not touch'!$B$10*0.5)-'Rates - do not touch'!$B$11-($B$12*$B$13)","v":2.9017199999999937E-2}]
[]
{"$rows_left_out":31}
{"sheet":"Cluster analysis","index":4,"n_rows":226,"n_cols":3,"rows_kept":226,"cut":false,"hidden":true,"merged":[]}
["Municipality","Code","Cluster"]
["ANTWERPEN",11002,3]
["BOECHOUT",11004,3]
["BORSBEEK",11007,3]
["BRASSCHAAT",11008,3]
["BRECHT",11009,2]
["EDEGEM",11013,3]
["HEMIKSEM",11018,3]
["HOVE",11021,3]
["KALMTHOUT",11022,1]
["KAPELLEN",11023,3]
["LINT",11025,3]
["MORTSEL",11029,3]
["NIEL",11030,3]
["RANST",11035,3]
{"$rows_left_out":211}